program: Gaussian 09
title: 000295278
version: EM64L-G09RevD.01
frameworkgroup: C1[X(C12H18N2OS)]
method: RPBEPBE
basis: SDD
operation: Freq
keyword: #p
keyword: freq=noraman
keyword: PBEPBE/SDD
title: #p freq=noraman PBEPBE/SDD
converged: YES YES NO NO
title: Mulliken charges:
elementType: S O N N C C C C C C C C C C C C H H H H H H H H H H H H H H H H H H
charge: 0.172028 -0.293688 -0.417285 -0.493667 -0.328732 -0.389273 -0.352846 -0.684305 0.289600 0.485758 -0.442539 -0.331713 -0.242192 -0.208053 -0.204851 -0.841519 0.221425 0.194987 0.207905 0.260683 0.190947 0.190628 0.284372 0.215169 0.215426 0.210900 0.286138 0.215559 0.309838 0.251776 0.248871 0.264609 0.262202 0.251843
chargesum: 0.00000
title: Mulliken charges with hydrogens summed into heavy atoms:
elementType: S O N N C C C C C C C C C C C C
charge: 0.172028 -0.293688 -0.132913 -0.207529 0.087680 0.079314 0.028730 -0.042810 0.289600 0.485758 -0.226980 -0.021875 -0.242192 0.043723 0.044019 -0.062866
polarizability: 2.66848432e+02 -1.88432061e+01 1.17609016e+02 1.03664534e+01 8.21297336e+00 1.42488451e+02
1716.lowfreq: -14.2752 -6.2646 -2.6074 -0.0015 0.0006 0.0016 6.1593 17.9838 29.5662
frequency: -7.5982 17.9071 29.5116 41.6649 61.4195 67.3358 96.7228 102.0507 130.5738 142.0250 186.5230 210.6478 228.7304 246.7883 250.9882 300.8464 322.0185 353.0938 375.2597 386.2397 412.0539 448.3061 515.0526 524.7666 584.5933 623.7573 638.4883 657.3450 698.7777 704.3903 719.4265 741.8501 818.3584 822.1147 827.1239 858.0560 862.5813 918.2921 946.1864 961.3212 973.0822 984.9995 989.5279 995.0553 997.6954 1051.7214 1078.2109 1108.7490 1112.9919 1122.2633 1135.1885 1183.8484 1209.3986 1227.6700 1259.2073 1269.9923 1286.2457 1290.4286 1310.1256 1336.7427 1347.4268 1353.1790 1367.6881 1390.7692 1401.8035 1443.4394 1448.6629 1458.0011 1460.1341 1472.7800 1475.6437 1478.2049 1484.8437 1488.5282 1501.2999 1584.6172 1607.2674 1646.0208 2955.9473 2975.5458 2977.2427 2991.1400 3001.6219 3006.5001 3045.3524 3072.5449 3074.7816 3078.1370 3107.1571 3130.1493 3131.4816 3145.3388 3156.0402 3193.3797 3524.6823 3556.4618
redmass: 3.8249 3.4181 4.2204 4.4624 2.1330 3.1396 3.6252 4.3348 2.3341 1.2178 3.7288 3.3695 1.3514 3.8198 2.9407 2.7647 2.1833 3.8284 2.9964 2.7778 2.9782 4.7234 2.6714 2.4786 1.2326 6.7309 6.6874 6.1057 3.4664 8.1331 3.5627 1.2620 3.3791 1.4466 1.9547 2.1009 1.4004 1.7124 1.3479 1.1722 1.7414 1.2811 1.3240 3.6546 3.0972 2.8029 2.7256 2.0664 1.5889 2.6391 1.8737 1.1140 1.8203 1.3628 1.4002 1.9424 1.1134 1.4131 1.2553 1.1315 1.6449 2.9188 1.4134 1.2107 4.4716 1.0584 1.1316 1.0837 1.0556 1.0862 1.8365 1.0447 1.0956 1.8486 2.5719 5.3282 6.0169 4.3626 1.0586 1.0394 1.0580 1.0669 1.0978 1.0278 1.1003 1.1003 1.0997 1.0990 1.0894 1.1061 1.1036 1.0910 1.0949 1.0946 1.0760 1.0772
irintensity: 0.9225 2.3307 2.4778 2.4413 1.5769 6.4389 0.1519 3.8987 1.2397 0.2683 0.2738 2.4002 0.6087 0.6331 1.8340 6.2206 21.8585 1.5520 15.0303 16.7951 0.1310 0.4203 0.1509 78.5248 136.6657 1.7781 0.2790 0.0612 6.0401 7.7746 0.2854 16.0055 2.0492 43.2831 1.9924 4.9567 46.3815 4.2498 0.3516 5.9186 12.1414 31.2487 6.2393 1.5116 8.9601 1.9824 0.1897 9.4975 10.8575 0.9739 3.7662 17.0325 292.9465 33.0665 112.1136 5.5705 4.2979 20.4340 42.2772 0.6730 49.7711 102.2722 16.7812 9.0353 11.3526 21.1888 41.2534 5.4353 10.9558 26.2787 83.4355 13.0741 15.9502 50.9108 908.8042 51.7234 66.7053 158.2624 31.2806 22.1619 58.4719 54.5459 6.8686 35.6664 55.8248 72.4358 47.2425 15.0021 23.8407 17.8660 17.0994 7.0138 6.1805 7.2163 4.9762 20.6569
temp: 298.150 k
press: 1.00000 atm
elementType: 16 8 7 7 6 6 6 6 6 6 6 6 6 6 6 6 1 1 1 1 1 1 1 1 1 1 1 1 1 1 1 1 1 1
symmnumber: 1
zpe: 737438.8 jmol-1
zpe.correction: 0.280876 hartree
zpe.thermalcorrener: 0.298251 hartree
zpe.thermalcorrenthalpy: 0.299195 hartree
zpe.thermalcorrgfe: 0.232963 hartree
zpe.sumelectzpe: -1049.663991 hartree
zpe.sumelectthermal: -1049.646616 hartree
zpe.sumelectthermalent: -1049.645671 hartree
zpe.sumelectthermalfe: -1049.711904 hartree
dipole: 3.9656 2.4984 3.1514
dipole: 5.6479
quadrupole: -99.7387 -107.0516 -97.5248
quadrupole: -8.3188 9.8855 -1.2964
quadrupole: 1.6997 -5.6133 3.9136 -8.3188 9.8855 -1.2964
hfenergy: -1049.9448668 hartree
pointgroup: C01 [X(C12H18N2O1S1)]
dipole: -1.5616743 -1.1606941 1.0731121 debye
polarizability: 267.408341|-15.7692137|120.077084|-11.4070077|-11.6267739|139.4604741 unknown
InChI: InChI=1S/C12H18N2OS/c1-3-4-9-13-12(15)14-10-5-7-11(16-2)8-6-10/h5-8,13-14H,3-4,9H2,1-2H3
charge 0 multiplicity 1
34 atoms
S  5.658438 -0.052268 -0.014727
O  -1.213726 1.315233 -0.957371
N  -2.66341 0.620239 0.737978
N  -0.363639 0.229285 0.966849
C  -4.615249 -0.02783 -0.736897
C  -3.867925 1.088434 0.030531
C  -5.195536 -1.136642 0.169906
C  -5.973437 -2.207594 -0.625656
C  -1.39763 0.758407 0.166798
C  1.026025 0.187653 0.67967
C  1.872196 -0.432725 1.641028
C  1.598288 0.733637 -0.502355
C  3.832269 0.020083 0.247404
C  3.26193 -0.516366 1.42557
C  2.991917 0.646979 -0.701847
C  5.757001 -1.586884 -1.122034
H  -3.92579 -0.471179 -1.481253
H  -5.440813 0.443889 -1.308585
H  -4.546464 1.562292 0.766904
H  -3.531947 1.865483 -0.677186
H  -5.864895 -0.678268 0.927682
H  -4.372105 -1.628322 0.728088
H  -2.78558 0.118622 1.61814
H  -5.319403 -2.696804 -1.371348
H  -6.377825 -2.993371 0.038422
H  -6.822805 -1.755154 -1.171087
H  -0.628196 -0.171967 1.869024
H  1.442397 -0.851908 2.560609
H  0.950286 1.218581 -1.234221
H  3.906476 -0.993368 2.170976
H  3.43355 1.082905 -1.604557
H  5.170147 -1.425422 -2.039117
H  5.3849 -2.468481 -0.578148
H  6.821256 -1.719071 -1.374595
