program: Gaussian 09
title: 000295273
version: EM64L-G09RevD.01
frameworkgroup: C1[X(C15H15ClN2O2)]
method: RPBEPBE
basis: SDD
operation: Freq
keyword: #p
keyword: freq=noraman
keyword: PBEPBE/SDD
title: #p freq=noraman PBEPBE/SDD
converged: YES YES NO NO
title: Mulliken charges:
elementType: Cl O O N N C C C C C C C C C C C C C C C H H H H H H H H H H H H H H H
charge: -0.085828 -0.264822 -0.287585 -0.498876 -0.496621 0.483762 0.341847 -0.465720 -0.311979 -0.330652 -0.372111 0.586316 0.269404 -0.353668 -0.311183 -0.243648 -0.223472 -0.222154 -0.246235 -0.684960 0.213434 0.306805 0.245009 0.249468 0.293735 0.293119 0.313995 0.205320 0.205667 0.253984 0.231431 0.234883 0.205997 0.232694 0.232645
chargesum: 0.00000
title: Mulliken charges with hydrogens summed into heavy atoms:
elementType: Cl O O N N C C C C C C C C C C C C C C C
charge: -0.085828 -0.264822 -0.287585 -0.205141 -0.203501 0.483762 0.341847 -0.252286 -0.005174 -0.085643 -0.122643 0.586316 0.269404 -0.353668 0.002812 0.167338 0.030513 0.009277 -0.011352 -0.013625
polarizability: 3.67459323e+02 -1.60736027e+01 2.00160463e+02 5.84743576e-02 -5.99554906e-02 8.38975593e+01
1716.lowfreq: -7.5030 -3.4917 -0.0013 -0.0004 0.0013 2.4026 18.2791 20.3440 48.0597
frequency: 18.0091 20.3269 48.0593 48.7132 74.3790 87.2996 114.6241 116.0301 150.3576 152.4987 171.9510 206.6955 248.7312 261.8799 262.4403 314.7725 355.3757 361.5501 376.5847 409.6028 413.6322 431.8281 433.2897 481.1832 526.7763 531.8982 549.2505 609.4403 628.3454 650.3548 665.4037 697.8980 716.7317 719.2091 743.8887 757.5691 770.4167 794.4694 806.1905 828.9296 850.7243 870.2171 880.2346 902.9411 914.0778 945.6444 982.9826 993.7081 993.8308 1000.0171 1011.8824 1038.2540 1040.1716 1116.0928 1124.4352 1126.8760 1135.6633 1170.6937 1177.8534 1188.3232 1216.7371 1243.4669 1259.2556 1269.6593 1305.0385 1314.0092 1356.9469 1368.8300 1375.3190 1399.7154 1422.4982 1428.6929 1459.7574 1461.2154 1476.6135 1487.1501 1500.8505 1510.0744 1522.9370 1576.5240 1593.5325 1614.3072 1631.0625 1652.3795 2947.1875 2996.4607 3004.3313 3093.8835 3105.4863 3108.2651 3141.4001 3158.2620 3161.1318 3165.3262 3176.1759 3193.2502 3199.1175 3477.8607 3526.6103
redmass: 4.1090 4.7078 5.9837 5.4601 4.8373 5.3431 1.8348 5.3022 6.2789 5.0215 4.5915 5.1835 1.1635 4.1467 8.4846 4.6537 4.0432 9.5686 5.4215 5.7583 3.0722 5.3351 3.1968 1.7260 2.4232 6.6511 2.7110 6.2761 7.0906 1.2329 7.0117 9.2487 4.0587 3.6756 4.8140 1.2358 7.1110 1.3636 5.4595 1.1087 1.4872 1.3416 5.9012 3.2747 1.3862 1.3536 1.3065 4.7793 1.3100 4.0598 4.9207 2.7278 1.9974 2.0855 1.3656 1.5160 1.4354 1.0664 1.6139 1.9711 2.2539 1.6333 1.1450 2.2497 1.3871 2.0113 1.8976 3.7303 3.1059 1.2852 3.9324 2.7673 2.4627 1.0401 1.0983 1.1713 1.9339 2.1951 2.5190 4.9436 5.4844 6.9389 6.4503 3.5593 1.0551 1.0362 1.1074 1.0989 1.1013 1.0897 1.0866 1.0919 1.0906 1.0932 1.0984 1.0952 1.0949 1.0760 1.0760
irintensity: 2.1110 1.2739 0.3084 0.1208 9.5318 0.3272 3.8986 1.7002 3.6088 0.0465 0.0430 7.4167 0.5960 3.0996 2.2912 0.8502 3.9440 10.0579 3.7041 0.9320 0.0021 2.7633 7.5642 12.7319 25.0726 24.7346 5.1702 4.1311 0.0422 104.8327 16.6212 29.5553 2.2420 0.0627 17.9370 112.1665 1.2419 52.4797 0.0285 0.2129 65.0437 6.6501 1.3661 57.1246 2.1350 6.0002 1.7421 13.1652 3.6854 23.9481 12.4795 107.8845 0.6250 4.0702 23.4135 0.9695 4.4642 3.0801 414.9654 100.8377 345.6234 10.9909 0.0481 26.6792 17.7227 79.2107 14.8570 82.6631 322.8716 68.0562 8.6960 89.5900 51.0053 11.8099 99.9261 126.0419 279.0530 1078.3693 21.4469 16.9691 69.8495 116.5506 2.5679 125.8757 46.7674 30.3713 40.9070 30.4422 34.6291 25.3757 4.1739 11.7586 5.2241 15.0053 10.1693 15.8614 7.0157 57.3255 15.8382
temp: 298.150 k
press: 1.00000 atm
elementType: 17 8 8 7 7 6 6 6 6 6 6 6 6 6 6 6 6 6 6 6 1 1 1 1 1 1 1 1 1 1 1 1 1 1 1
symmnumber: 1
zpe: 711314.7 jmol-1
zpe.correction: 0.270925 hartree
zpe.thermalcorrener: 0.289779 hartree
zpe.thermalcorrenthalpy: 0.290723 hartree
zpe.thermalcorrgfe: 0.221031 hartree
zpe.sumelectzpe: -1299.187342 hartree
zpe.sumelectthermal: -1299.168488 hartree
zpe.sumelectthermalent: -1299.167544 hartree
zpe.sumelectthermalfe: -1299.237236 hartree
dipole: -1.0020 3.4666 0.0038
dipole: 3.6085
quadrupole: -95.9620 -117.4806 -130.8518
quadrupole: -14.1381 -0.0062 -0.0297
quadrupole: 18.8028 -2.7158 -16.0870 -14.1381 -0.0062 -0.0297
hfenergy: -1299.4582671 hartree
pointgroup: C01 [X(C15H15Cl1N2O2)]
dipole: 0.4481412 1.3461698 0.050304 debye
polarizability: 368.2500909|9.717506|198.9007978|-7.5444622|5.2937333|84.3664564 unknown
InChI: InChI=1S/C15H15ClN2O2/c1-2-20-12-9-7-11(8-10-12)17-15(19)18-14-6-4-3-5-13(14)16/h3-10,17-18H,2H2,1H3
charge 0 multiplicity 1
35 atoms
Cl -4.293812 2.726655 0.184884
O  5.605889 -0.616026 -0.252561
O  -0.949102 -1.44115 -0.103243
N  0.089066 0.675966 -0.029328
N  -2.232827 0.539763 0.024363
C  1.469538 0.317979 -0.085172
C  4.256601 -0.229435 -0.192214
C  2.416971 1.371578 -0.058813
C  1.93186 -1.025262 -0.16489
C  3.802571 1.110098 -0.111097
C  3.312033 -1.285069 -0.217528
C  -3.542359 0.013334 0.035778
C  -1.019914 -0.178868 -0.040853
C  -4.641009 0.91557 0.10842
C  -3.847986 -1.376629 -0.021188
C  6.624538 0.450344 -0.23152
C  -5.978099 0.494351 0.125151
C  -5.18879 -1.811317 -0.004923
C  -6.258851 -0.890684 0.067596
C  7.98525 -0.235471 -0.319602
H  2.075707 2.413666 0.003292
H  1.208221 -1.841318 -0.184435
H  4.503131 1.949465 -0.087819
H  3.680916 -2.313454 -0.279671
H  -0.08514 1.681757 0.02552
H  -2.1971 1.563142 0.069323
H  -3.017805 -2.082679 -0.077189
H  6.462872 1.134002 -1.091162
H  6.529181 1.034965 0.707384
H  -6.782828 1.23279 0.182074
H  -5.395697 -2.885853 -0.049914
H  -7.297474 -1.235261 0.079815
H  8.793197 0.518642 -0.307745
H  8.131831 -0.919738 0.533386
H  8.065724 -0.821054 -1.251216
