program: Gaussian 09
title: 000295252
version: EM64L-G09RevD.01
frameworkgroup: C1[X(C15H14N2O3)]
method: RPBEPBE
basis: SDD
operation: Freq
keyword: #p
keyword: freq=noraman
keyword: PBEPBE/SDD
title: #p freq=noraman PBEPBE/SDD
converged: YES YES NO NO
title: Mulliken charges:
elementType: O O O N N C C C C C C C C C C C C C C C H H H H H H H H H H H H H H
charge: -0.278690 -0.287362 -0.333441 -0.513439 -0.499966 0.338556 0.021953 -0.322933 -0.305758 0.479545 -0.214890 0.248639 -0.250888 0.229418 -0.449684 -0.335355 -0.197290 -0.215108 -0.258698 -0.497119 0.357645 0.313769 0.271393 0.231935 0.233492 0.308819 0.217923 0.305328 0.225081 0.224965 0.227894 0.243939 0.243891 0.236436
chargesum: 0.00000
title: Mulliken charges with hydrogens summed into heavy atoms:
elementType: O O O N N C C C C C C C C C C C C C C C
charge: -0.278690 -0.287362 -0.333441 -0.155794 -0.191146 0.338556 0.021953 -0.009164 -0.034365 0.479545 0.017045 0.248639 -0.017396 0.229418 -0.231761 -0.030027 0.027791 0.009857 -0.030804 0.227147
polarizability: 3.32027233e+02 1.27635682e+01 2.23883182e+02 2.08174670e-02 -9.53137797e-02 7.69701555e+01
1716.lowfreq: -6.3914 -6.1730 -0.0005 -0.0001 0.0006 2.1181 25.2870 33.8498 57.2676
frequency: 25.2569 33.8294 57.2676 64.5775 82.2032 94.0298 103.5745 135.4617 140.7906 177.0161 205.4043 218.0690 238.4610 276.2427 309.8351 339.3850 354.5278 400.7062 406.7736 433.3145 485.6515 498.2876 524.2778 530.8884 581.1372 613.3483 628.8184 660.7178 680.2649 695.0901 704.2896 750.2236 756.0633 766.4184 784.3191 784.9821 800.9972 839.0710 880.5898 885.2193 899.2524 913.9359 922.1469 970.0474 978.0586 982.7787 997.2655 999.1063 1006.8793 1028.8874 1040.2560 1065.5669 1090.1868 1114.1037 1135.2564 1150.0287 1171.7653 1175.8876 1188.8750 1196.0948 1238.8384 1259.5514 1276.1262 1319.7126 1323.0557 1382.4380 1384.5014 1423.7281 1429.7078 1442.2147 1452.2924 1455.0808 1463.7566 1486.4392 1510.4581 1525.1113 1569.2770 1597.0565 1601.6452 1616.2238 1629.4706 1672.5032 3006.9736 3107.6203 3109.8539 3130.8416 3136.4896 3142.9402 3151.8477 3157.8586 3164.4886 3180.9561 3188.7885 3194.2618 3196.8455 3520.3548
redmass: 3.8989 6.0604 5.3624 5.5949 4.6435 1.3345 3.0141 4.1352 4.6542 4.9796 4.6700 6.2114 3.8778 4.7220 7.7674 5.1861 7.1171 8.9309 2.9289 3.6184 6.7513 2.2550 3.2001 7.3338 1.3962 6.4304 6.6074 6.5775 5.2212 1.9981 9.3554 6.2949 2.7619 1.7002 1.6184 6.4106 5.9702 1.2710 6.0038 1.1410 1.4074 1.4340 8.3351 1.3512 1.3632 6.1726 1.3046 6.6155 1.3158 2.1325 2.4005 4.0633 1.5781 1.2591 1.7295 1.5442 1.0521 1.0966 1.1126 2.8694 2.0779 2.5022 2.0332 1.5953 1.9967 6.0883 6.4081 1.4820 2.3875 2.1098 1.0499 2.4849 1.0983 2.4327 2.6493 2.5716 6.4193 3.6496 5.8208 5.7886 6.2439 2.0666 1.0295 1.0885 1.1047 1.0866 1.0875 1.0933 1.1049 1.0922 1.0999 1.0965 1.0832 1.0952 1.0947 1.0764
irintensity: 0.5662 1.2565 0.3550 0.1233 3.7723 2.7805 3.7177 0.4163 0.9601 6.5123 16.6383 0.9606 1.4708 0.2391 0.7495 20.7377 15.0731 1.6482 0.0097 0.4305 8.9686 24.9561 16.0883 3.8700 24.4688 0.6914 6.5552 2.5804 16.7455 44.4981 1.6758 14.9801 14.6730 89.6036 64.5894 0.1850 5.4337 0.6146 0.3632 124.4627 9.5856 20.6307 4.4423 0.0225 3.5746 0.8416 3.0179 7.8968 3.4285 18.6101 21.0673 112.4240 25.1193 0.0563 25.3314 122.5254 0.4592 32.0895 1.4184 286.3029 163.0326 584.1152 138.0561 224.1519 29.4078 0.7265 145.2825 54.3935 106.9974 43.2486 14.8085 26.0423 4.9935 242.7412 1142.6931 23.6534 25.7951 363.3829 57.5357 45.8594 178.9156 18.1597 40.3820 16.1560 24.8833 0.3284 8.7365 30.7833 19.7256 15.8585 31.6384 9.0762 274.3825 13.3893 5.0565 14.4187
temp: 298.150 k
press: 1.00000 atm
elementType: 8 8 8 7 7 6 6 6 6 6 6 6 6 6 6 6 6 6 6 6 1 1 1 1 1 1 1 1 1 1 1 1 1 1
symmnumber: 1
zpe: 690383.3 jmol-1
zpe.correction: 0.262953 hartree
zpe.thermalcorrener: 0.280706 hartree
zpe.thermalcorrenthalpy: 0.281651 hartree
zpe.thermalcorrgfe: 0.215355 hartree
zpe.sumelectzpe: -913.794126 hartree
zpe.sumelectthermal: -913.776373 hartree
zpe.sumelectthermalent: -913.775429 hartree
zpe.sumelectthermalfe: -913.841725 hartree
dipole: -2.6679 3.1621 0.0008
dipole: 4.1372
quadrupole: -96.7337 -101.2545 -122.5793
quadrupole: -0.6867 -0.0008 -0.0242
quadrupole: 10.1221 5.6013 -15.7234 -0.6867 -0.0008 -0.0242
hfenergy: -914.0570795 hartree
pointgroup: C01 [X(C15H14N2O3)]
dipole: -1.0219619 -1.2666031 0.0262 debye
polarizability: 332.4988317|-10.4102709|223.3566924|-2.9534716|-1.6229136|77.025047 unknown
InChI: InChI=1S/C15H14N2O3/c1-20-14(18)12-9-5-6-10-13(12)17-15(19)16-11-7-3-2-4-8-11/h2-10,16-17H,1H3
charge 0 multiplicity 1
34 atoms
O  -4.177181 -1.98333 0.107134
O  1.123065 1.851257 0.004977
O  -1.865905 -2.147551 0.085513
N  -0.477105 0.100205 0.046224
N  1.780153 -0.415777 0.025876
C  -1.687421 0.812079 0.050401
C  -2.923479 0.062471 0.07164
C  -1.747854 2.235922 0.034572
C  -4.165007 0.759442 0.076497
C  3.198183 -0.305278 0.004491
C  -2.991437 2.890217 0.039886
C  0.832141 0.619187 0.025168
C  -4.208828 2.161482 0.060852
C  -2.910581 -1.413277 0.087986
C  3.939335 -1.519651 0.010529
C  3.888598 0.93665 -0.022256
C  5.34793 -1.495876 -0.00987
C  5.300107 0.941331 -0.042385
C  6.040665 -0.26277 -0.036499
C  -4.219848 -3.464548 0.123672
H  -0.625166 -0.930048 0.059971
H  -0.811403 2.795524 0.018366
H  -5.085773 0.170639 0.092731
H  -3.012363 3.985865 0.02753
H  -5.169927 2.684823 0.064805
H  1.42437 -1.374811 0.042703
H  3.410673 -2.48214 0.031243
H  3.317833 1.866399 -0.026968
H  5.902893 -2.440606 -0.004893
H  5.824502 1.903477 -0.063045
H  7.13544 -0.242721 -0.052317
H  -3.708559 -3.851839 1.020595
H  -3.730398 -3.871046 -0.776953
H  -5.290752 -3.709801 0.139227
