program: Gaussian 09
title: 000295241
version: EM64L-G09RevD.01
frameworkgroup: C1[X(C14H11Cl2NO)]
method: RPBEPBE
basis: SDD
operation: Freq
keyword: #p
keyword: freq=noraman
keyword: PBEPBE/SDD
title: #p freq=noraman PBEPBE/SDD
converged: YES YES NO NO
title: Mulliken charges:
elementType: Cl Cl O N C C C C C C C C C C C C C C H H H H H H H H H H H
charge: -0.063887 -0.040919 -0.259358 -0.482582 0.334453 0.292070 -0.326211 -0.363565 0.257305 0.138971 -0.845123 -0.231210 -0.112801 -0.331517 -0.342798 -0.210735 -0.219648 -0.099907 0.337388 0.314910 0.257576 0.252373 0.233792 0.229304 0.256767 0.281328 0.221377 0.262745 0.259902
chargesum: 0.00000
title: Mulliken charges with hydrogens summed into heavy atoms:
elementType: Cl Cl O N C C C C C C C C C C C C C C
charge: -0.063887 -0.040919 -0.259358 -0.145194 0.334453 0.292070 -0.011301 -0.105988 0.257305 0.138971 -0.129654 0.025557 -0.112801 -0.050189 -0.121421 0.052009 0.040254 -0.099907
polarizability: 3.47855094e+02 3.70432345e+00 1.70508668e+02 4.37540386e+00 -5.32290023e+00 7.67470956e+01
1716.lowfreq: -4.4355 -0.0019 -0.0014 0.0017 1.4348 7.3894 22.1813 33.5131 48.5256
frequency: 22.1575 33.4247 48.5209 76.0999 88.7374 136.1464 161.0787 180.4622 195.3559 206.1092 233.8982 260.2270 284.0349 310.7867 352.8925 366.1575 407.5923 420.3933 445.4420 452.5724 481.6561 509.6893 537.9569 547.6428 620.6635 630.1273 645.1142 675.9600 705.0692 722.0024 741.0567 781.9812 823.1119 842.9521 849.3106 859.7955 871.4918 871.5794 950.2128 980.1176 983.5246 988.3978 998.4476 1042.2555 1070.0771 1079.4317 1091.1922 1112.2030 1124.3496 1187.3869 1193.8155 1244.3352 1264.5571 1285.9960 1299.1768 1368.1201 1370.1256 1394.4767 1398.5777 1400.7519 1449.5874 1474.9979 1481.5785 1484.7763 1511.3782 1569.3535 1587.1297 1596.4244 1608.1420 1612.3294 2956.4755 3025.9212 3092.7517 3124.4215 3158.3280 3158.5093 3168.8182 3172.8866 3177.7411 3195.1161 3547.1846
redmass: 8.5537 4.2136 8.2926 7.4533 8.5625 6.0633 5.1030 2.1931 7.0320 1.4502 5.5496 6.0383 5.7814 9.4389 7.4093 5.9174 2.8902 5.6785 3.1930 4.0909 4.0178 5.6762 5.2370 3.0759 3.9758 1.8640 3.4598 4.8413 6.8858 3.9015 3.5552 4.8276 1.4476 1.3692 1.6621 4.2267 1.5624 3.7847 1.3741 1.3163 1.3769 1.5267 4.1634 1.5146 4.8072 2.4388 2.0529 1.3732 1.8044 1.1425 1.8124 3.4188 1.5362 1.6899 1.4755 5.0289 6.7473 3.4207 1.3467 3.7839 1.8579 2.2470 1.1148 1.4475 1.9581 7.3471 6.0912 6.3279 7.5311 4.3106 1.0402 1.0979 1.0946 1.0896 1.0925 1.0888 1.0910 1.0951 1.0974 1.0956 1.0753
irintensity: 0.1293 0.0082 0.4651 3.8755 3.5125 1.7105 1.3550 1.5345 2.0555 0.2222 0.6962 1.3087 1.2353 1.4170 22.8983 9.5316 0.7020 0.4505 5.9870 15.1361 8.9624 15.1688 7.5614 22.7861 10.2979 20.9979 22.3440 21.1555 2.7288 3.0874 27.7653 6.6007 14.7308 49.6424 29.1185 33.6771 31.9861 62.3931 0.9642 3.3672 4.9071 6.0533 46.9097 7.0323 17.4888 54.7107 9.6646 24.9076 5.3005 5.5226 33.7940 84.8244 2.8615 52.4560 22.1076 6.5098 126.1922 1.3403 19.3373 59.0874 112.1178 71.2724 44.4430 194.3604 362.2277 21.3546 29.6899 53.4980 52.8843 52.1310 27.6578 20.2280 17.5120 15.1211 3.7134 0.1118 1.6191 2.8485 2.2894 10.5624 17.5455
temp: 298.150 k
press: 1.00000 atm
elementType: 17 17 8 7 6 6 6 6 6 6 6 6 6 6 6 6 6 6 1 1 1 1 1 1 1 1 1 1 1
symmnumber: 1
zpe: 558540.2 jmol-1
zpe.correction: 0.212737 hartree
zpe.thermalcorrener: 0.229070 hartree
zpe.thermalcorrenthalpy: 0.230014 hartree
zpe.thermalcorrgfe: 0.166719 hartree
zpe.sumelectzpe: -1588.947099 hartree
zpe.sumelectthermal: -1588.930765 hartree
zpe.sumelectthermalent: -1588.929821 hartree
zpe.sumelectthermalfe: -1588.993116 hartree
dipole: 1.6570 3.5835 0.4117
dipole: 3.9694
quadrupole: -139.5636 -110.3472 -121.9923
quadrupole: -4.0573 0.4982 -2.0641
quadrupole: -15.5959 13.6205 1.9754 -4.0573 0.4982 -2.0641
hfenergy: -1589.1598354 hartree
pointgroup: C01 [X(C14H11Cl2N1O1)]
dipole: 0.6084062 -1.4264365 -0.1843972 debye
polarizability: 347.4116961|-8.958093|171.0091382|-6.2342736|-3.8916129|76.690024 unknown
InChI: InChI=1S/C14H11Cl2NO/c1-9-8-12(16)6-7-13(9)17-14(18)10-2-4-11(15)5-3-10/h2-8,17H,1H3
charge 0 multiplicity 1
29 atoms
Cl -6.412043 0.195154 0.097818
Cl 6.497816 -0.826033 -0.047425
O  0.321638 2.114162 0.10547
N  -0.366886 -0.128356 -0.07098
C  -1.784851 -0.007785 -0.031098
C  -2.551605 -1.208699 -0.179604
C  -2.436245 1.240812 0.152733
C  -3.961203 -1.122241 -0.136988
C  2.026569 0.393992 0.019033
C  0.597762 0.87721 0.029011
C  -1.880487 -2.558315 -0.376073
C  -3.844436 1.307295 0.1946
C  -4.588394 0.124098 0.04867
C  3.021937 1.326991 -0.370547
C  2.423934 -0.910828 0.415091
C  4.3833 0.965145 -0.398005
C  3.784107 -1.287734 0.39807
C  4.743487 -0.343797 -0.017934
H  -0.013399 -1.071232 -0.239857
H  -1.834377 2.144954 0.255345
H  -4.564903 -2.028008 -0.248134
H  -2.633057 -3.356318 -0.480218
H  -1.255044 -2.585927 -1.291213
H  -1.237794 -2.833088 0.484997
H  -4.345838 2.268661 0.336846
H  2.706316 2.339251 -0.641535
H  1.693041 -1.638928 0.787417
H  5.148411 1.683326 -0.705779
H  4.092745 -2.288164 0.713787
