program: Gaussian 09
title: 000027363
version: EM64L-G09RevD.01
frameworkgroup: C1[X(C4H4Cl2O4)]
method: RPBEPBE
basis: SDD
operation: Freq
keyword: #p
keyword: freq=noraman
keyword: PBEPBE/SDD
title: #p freq=noraman PBEPBE/SDD
converged: YES YES NO NO
title: Mulliken charges:
elementType: Cl Cl O O O O C C C C H H H H
charge: 0.086629 0.062928 -0.411399 -0.416353 -0.176191 -0.210394 -0.493267 -0.391195 0.349360 0.217118 0.295447 0.294382 0.396750 0.396187
chargesum: 0.00000
title: Mulliken charges with hydrogens summed into heavy atoms:
elementType: Cl Cl O O O O C C C C
charge: 0.086629 0.062928 -0.014649 -0.020166 -0.176191 -0.210394 -0.493267 0.198634 0.349360 0.217118
polarizability: 7.92640417e+01 2.50855326e-01 6.83737861e+01 -5.27589703e+00 2.45813085e+00 7.40080419e+01
1716.lowfreq: -10.7226 -7.6258 0.0023 0.0029 0.0033 5.4290 37.9450 75.5514 100.6462
frequency: 37.8962 75.5483 100.6407 116.8853 173.6553 200.6928 239.3029 271.8279 303.9066 366.8538 390.4288 493.1675 519.5762 554.6803 572.7091 629.7406 646.3418 657.3399 766.7362 804.4802 850.9471 978.0024 1051.3361 1088.0023 1120.5601 1236.4385 1292.7318 1305.6518 1324.3505 1421.5932 1677.8067 1683.9906 3029.2201 3111.8515 3522.1047 3538.3680
redmass: 12.0481 11.6682 6.9398 10.5949 9.8290 9.0750 13.2212 12.2617 3.7233 6.7937 11.2719 2.0888 1.9391 2.2509 4.2483 1.7171 3.6003 3.3698 8.4480 4.1313 4.8449 2.9676 2.6956 2.2994 3.3948 1.2059 2.1877 2.4255 1.4669 1.0811 9.4007 10.7224 1.0629 1.0984 1.0643 1.0646
irintensity: 2.3280 0.5370 1.5297 0.3301 0.8797 0.2781 0.4519 0.8730 1.3710 0.8392 0.6409 23.1669 6.0444 121.5944 30.1955 210.2851 153.8985 7.0408 19.5464 3.3746 17.2907 164.8065 166.0973 139.5579 54.7382 6.6021 9.5865 58.2179 7.1529 19.1584 316.7372 179.1798 2.3798 0.1793 43.0718 47.8914
temp: 298.150 k
press: 1.00000 atm
elementType: 17 17 8 8 8 8 6 6 6 6 1 1 1 1
symmnumber: 1
zpe: 216257.1 jmol-1
zpe.correction: 0.082368 hartree
zpe.thermalcorrener: 0.093100 hartree
zpe.thermalcorrenthalpy: 0.094044 hartree
zpe.thermalcorrgfe: 0.044603 hartree
zpe.sumelectzpe: -1375.071942 hartree
zpe.sumelectthermal: -1375.061210 hartree
zpe.sumelectthermalent: -1375.060266 hartree
zpe.sumelectthermalfe: -1375.109707 hartree
dipole: -0.8893 2.3515 -1.5233
dipole: 2.9395
quadrupole: -75.7546 -64.3078 -73.0301
quadrupole: -5.0669 -6.8542 -3.1488
quadrupole: -4.7237 6.7230 -1.9993 -5.0669 -6.8542 -3.1488
hfenergy: -1375.1543095 hartree
pointgroup: C01 [X(C4H4Cl2O4)]
dipole: -0.1767561 -0.9764975 0.593887 debye
dipolederiv: -0.1838917 0.0139093 -0.0878721 0.0483649 -0.1886598 0.2144474 -0.1002184 0.1557744 -0.4807964 -0.5414243 -0.1254198 -0.22189 -0.1981126 -0.2667595 -0.1403547 -0.2065955 -0.0939339 -0.3018935 -0.4042381 0.0309432 -0.0617652 -0.0421846 -0.708701 0.5064178 0.009007 0.4062268 -0.8288978 -0.387914 0.0398817 0.0814869 0.1026712 -0.8973048 -0.3601416 0.1117767 -0.3783895 -0.6244877 -0.3897141 0.1220811 0.2396574 0.165383 -0.5644368 -0.1971416 0.1602863 0.0195196 -0.7743632 -1.0406329 0.1958849 0.2191209 0.0502812 -0.5085096 -0.1443147 0.0139044 -0.1515158 -0.4118268 0.9102524 0.194791 0.3200551 0.1640196 0.3117296 -0.1305487 0.3148636 -0.2735763 0.8994641 -0.3403713 -0.0713768 -0.0609708 -0.0763521 -0.1257985 -0.0465314 -0.1175941 -0.0523288 -0.1551695 0.3829284 -0.281042 -0.2652262 -0.2060764 1.1841541 -0.2006297 -0.2973256 -0.159058 1.2154305 1.4119923 -0.152506 -0.2003508 -0.0968365 1.0415501 0.5670669 0.0011322 0.6246882 0.6482457 0.0482148 0.031637 0.0130772 0.0115109 0.0117796 -0.0314209 0.0275918 -0.0267002 0.1249633 0.079922 -0.0426736 -0.0007672 -0.0242162 0.1075037 0.0550526 0.0042188 0.0660227 0.0590724 0.3477164 0.0690168 0.0573467 0.0774402 0.2396326 -0.0723913 0.0869325 -0.1086555 0.2759801 0.1071601 -0.0251269 -0.0319019 0.0241072 0.3638204 -0.01951 -0.0079796 -0.0280736 0.3542787 unknown
polarizability: 79.1653536|1.6188243|68.55663|4.7126023|3.2611316|73.923886 unknown
InChI: InChI=1S/C4H4Cl2O4/c5-4(6,3(9)10)1-2(7)8/h7,9H,1H2
charge 0 multiplicity 1
14 atoms
Cl 0.274787 1.459804 -1.529594
Cl 2.03504 1.440125 0.956833
O  1.137217 -1.622503 0.898508
O  -1.604112 -1.092167 -0.436295
O  1.621518 -1.255247 -1.348893
O  -3.037523 0.370612 0.662049
C  0.616253 0.550763 0.051804
C  -0.606909 0.602606 0.972599
C  1.170677 -0.855511 -0.266205
C  -1.880559 -0.008059 0.399116
H  -0.827443 1.649428 1.23514
H  -0.358568 0.061445 1.904489
H  1.521506 -2.521029 0.715504
H  -2.447584 -1.467268 -0.808053
