program: Gaussian 09
title: 000295235
version: EM64L-G09RevD.01
frameworkgroup: C1[X(C14H12ClNO)]
method: RPBEPBE
basis: SDD
operation: Freq
keyword: #p
keyword: freq=noraman
keyword: PBEPBE/SDD
title: #p freq=noraman PBEPBE/SDD
converged: YES YES NO NO
title: Mulliken charges:
elementType: Cl O N C C C C C C C C C C C C C C H H H H H H H H H H H H
charge: -0.063661 -0.258103 -0.488225 0.350079 0.270254 -0.285723 -0.374465 0.243987 0.141121 -0.846814 -0.108345 -0.265440 -0.340248 -0.355291 -0.222481 -0.237119 -0.226153 0.339191 0.334733 0.234031 0.232344 0.249122 0.228905 0.256546 0.276037 0.213428 0.235433 0.231602 0.235258
chargesum: 0.00000
title: Mulliken charges with hydrogens summed into heavy atoms:
elementType: Cl O N C C C C C C C C C C C C C C
charge: -0.063661 -0.258103 -0.149035 0.350079 0.270254 0.049010 -0.140433 0.243987 0.141121 -0.136445 -0.108345 -0.008893 -0.064211 -0.141864 0.012952 -0.005517 0.009106
polarizability: 2.78975421e+02 -9.02345203e-01 1.84962779e+02 -2.14899137e+00 -8.09398248e+00 7.48478543e+01
1716.lowfreq: -4.6641 -2.3857 -0.0023 -0.0019 -0.0012 5.6582 25.2203 38.8361 66.3132
frequency: 25.2076 38.8291 66.3059 87.7991 110.4510 140.2856 166.9746 193.9089 229.8881 253.6843 279.0100 310.9073 322.4830 360.1253 401.1339 412.4579 445.6252 451.8105 474.3304 572.3838 579.8592 613.9601 626.5166 636.8770 669.1846 686.7912 702.7686 722.7567 764.3403 791.7202 805.0049 852.7640 861.2772 887.3204 926.3663 934.6173 939.2199 983.4279 984.4458 989.3786 1006.7216 1023.9602 1042.2586 1072.2871 1081.4522 1093.0405 1134.6071 1174.8754 1185.7840 1192.4199 1238.9462 1267.9636 1271.9079 1317.7743 1372.1659 1384.5532 1395.1478 1410.8645 1432.3780 1450.6284 1479.3279 1480.3897 1483.6190 1510.1578 1576.4249 1588.8287 1608.5327 1610.7859 1613.5687 2953.3070 3021.9722 3088.4007 3112.2248 3133.7323 3134.5491 3146.4865 3159.4723 3171.1148 3178.1815 3196.7076 3547.2146
redmass: 4.8371 5.4135 5.5004 5.5043 4.2873 7.5422 5.2044 1.0624 3.9256 4.8859 6.3036 6.4149 3.9992 9.7242 2.8297 4.7065 3.4935 3.0851 4.8354 3.8912 4.7522 6.1530 6.3917 1.3641 6.3254 5.1238 1.5489 3.3937 5.1007 2.4133 1.2925 1.2680 6.0699 5.5349 1.3448 1.4593 1.3562 1.4465 1.5270 5.1688 1.3468 2.5241 1.5177 2.3235 1.9468 2.1816 1.5472 1.0580 1.8861 1.1989 2.7899 2.4382 1.5134 1.3364 5.8497 8.7082 1.3262 3.5249 2.2408 2.0141 1.6464 1.3029 1.3426 2.0533 6.7291 5.4828 5.9467 4.5874 7.0677 1.0402 1.0978 1.0947 1.0880 1.0867 1.0899 1.0917 1.0956 1.1008 1.0956 1.0931 1.0753
irintensity: 0.2215 1.5572 0.3608 3.6254 0.0178 1.2003 0.8914 0.6359 0.9079 0.1079 2.8585 9.1372 3.5467 4.7951 0.2529 1.7029 0.3249 12.7214 6.9112 9.0528 14.4531 1.8665 10.5258 47.1304 14.4765 10.8558 104.3609 7.8397 4.5769 20.5636 43.5884 1.0772 10.0100 50.0869 25.1754 3.6537 4.5869 6.0012 20.5661 0.4468 1.6614 16.7789 6.4430 10.0999 15.4423 18.6734 8.3408 1.4676 3.5032 11.5305 88.5392 102.0750 7.6261 0.5172 74.8051 0.8034 8.0369 109.2209 7.8110 128.8626 15.9326 33.2495 81.4558 391.1935 75.9745 85.0897 25.3791 13.4567 62.7740 33.0632 21.8488 18.2488 15.6470 0.7785 15.7177 19.3795 14.8002 22.8694 3.2087 19.1644 17.4515
temp: 298.150 k
press: 1.00000 atm
elementType: 17 8 7 6 6 6 6 6 6 6 6 6 6 6 6 6 6 1 1 1 1 1 1 1 1 1 1 1 1
symmnumber: 1
zpe: 584058.4 jmol-1
zpe.correction: 0.222456 hartree
zpe.thermalcorrener: 0.237450 hartree
zpe.thermalcorrenthalpy: 0.238394 hartree
zpe.thermalcorrgfe: 0.178711 hartree
zpe.sumelectzpe: -1129.557500 hartree
zpe.sumelectthermal: -1129.542506 hartree
zpe.sumelectthermalent: -1129.541562 hartree
zpe.sumelectthermalfe: -1129.601245 hartree
dipole: -3.5292 5.4422 0.3580
dipole: 6.4962
quadrupole: -93.1797 -100.2729 -110.6183
quadrupole: 6.6635 0.1044 -2.5553
quadrupole: 8.1773 1.0841 -9.2613 6.6635 0.1044 -2.5553
hfenergy: -1129.7799556 hartree
pointgroup: C01 [X(C14H12Cl1N1O1)]
dipole: -1.158177 2.2781996 0.0237964 debye
polarizability: 277.7982376|-10.5938155|185.236227|-0.0395161|-12.9522524|75.7515906 unknown
InChI: InChI=1S/C14H12ClNO/c1-10-7-8-12(15)9-13(10)16-14(17)11-5-3-2-4-6-11/h2-9,16H,1H3
charge 0 multiplicity 1
29 atoms
Cl 4.488269 -2.553868 0.018005
O  -0.518258 -1.94189 0.095457
N  0.08404 0.330968 0.076647
C  1.503826 0.262751 0.08592
C  2.224471 1.500987 0.123652
C  2.196189 -0.977692 0.05555
C  3.635824 1.452602 0.127148
C  -2.288175 -0.285878 -0.022069
C  -0.843873 -0.716164 0.047959
C  1.498585 2.835722 0.155564
C  3.599697 -0.959053 0.05869
C  4.346926 0.231203 0.094331
C  -3.262235 -1.214056 0.427773
C  -2.713414 0.965575 -0.543746
C  -4.633044 -0.888184 0.385704
C  -4.087033 1.28929 -0.589581
C  -5.049759 0.366929 -0.118254
H  -0.307903 1.271652 0.139231
H  1.631417 -1.910666 0.036063
H  4.198197 2.392806 0.155437
H  0.845418 2.938426 1.045906
H  2.219547 3.668537 0.191926
H  0.871444 2.993037 -0.745719
H  5.439723 0.211545 0.097346
H  -2.917694 -2.18502 0.798053
H  -1.991582 1.678455 -0.962504
H  -5.376005 -1.610023 0.741569
H  -4.406569 2.251588 -1.004099
H  -6.115129 0.619623 -0.15456
