program: Gaussian 09
title: 000027372
version: EM64L-G09RevD.01
frameworkgroup: C1[X(C7H13NO3S)]
method: RPBEPBE
basis: SDD
operation: Freq
keyword: #p
keyword: freq=noraman
keyword: PBEPBE/SDD
title: #p freq=noraman PBEPBE/SDD
converged: NO YES NO NO
title: Mulliken charges:
elementType: S O O O N C C C C C C C H H H H H H H H H H H H H
charge: -0.000804 -0.404585 -0.218592 -0.268953 -0.378369 -0.236530 -0.050629 -0.651385 -0.646607 0.156615 0.250806 -0.791240 0.324242 0.212660 0.237003 0.248099 0.224155 0.236471 0.221693 0.316435 0.097703 0.262754 0.244429 0.232266 0.382362
chargesum: 0.00000
title: Mulliken charges with hydrogens summed into heavy atoms:
elementType: S O O O N C C C C C C C
charge: 0.096899 -0.022223 -0.218592 -0.268953 -0.061933 -0.236530 0.273613 0.046378 0.035712 0.156615 0.250806 -0.051792
polarizability: 1.17367792e+02 1.73317378e+00 1.14704890e+02 -5.30190475e-01 -1.37657315e+00 9.33133534e+01
1716.lowfreq: -59.8476 -26.5394 -6.1801 0.0014 0.0022 0.0027 5.4444 12.5515 33.2276
frequency: -59.8345 -19.4705 32.4709 62.6973 80.2343 129.9943 149.1008 201.0651 212.5621 223.0023 243.9311 265.7767 281.8866 299.5331 326.3721 344.7803 368.8436 425.7623 506.3885 520.3930 527.7498 575.5662 595.6871 634.6334 650.0775 704.2222 807.0870 828.7911 904.4918 931.8192 937.6736 958.0013 989.9794 1012.4582 1036.8545 1042.3023 1126.9268 1138.7084 1171.0721 1223.0754 1250.7777 1255.1217 1291.1793 1356.4640 1376.9841 1390.3744 1408.8913 1442.8409 1451.2352 1459.5553 1467.7274 1471.2275 1476.0046 1487.2533 1630.7336 1662.1698 2427.4467 2982.2823 2988.8092 2991.8185 3054.6517 3074.9661 3078.3453 3081.1646 3089.0802 3101.5555 3136.3328 3508.7864 3562.5311
redmass: 1.2767 3.2515 4.5231 6.3798 4.0046 4.7246 3.9053 1.2052 1.2599 2.5915 2.3415 1.5568 2.3834 3.7570 3.6040 3.2947 3.7053 2.7676 1.6883 2.3194 3.0631 2.5435 2.7563 1.8913 4.2775 3.5054 2.4149 1.5241 3.6169 2.6074 1.7860 1.7372 1.6585 1.4558 1.6833 2.6417 1.7943 3.8084 2.7450 2.8072 1.6589 1.8900 1.8057 1.5063 1.2614 1.2010 1.1956 1.2205 1.0530 1.0729 1.0511 1.0627 1.0964 1.3895 6.4247 8.5245 1.0381 1.0367 1.0362 1.0379 1.0841 1.0987 1.0983 1.0988 1.0995 1.0998 1.0984 1.0641 1.0778
irintensity: 0.6696 6.6972 0.7995 2.8627 8.6800 4.4992 1.6366 4.1598 14.2103 5.9230 3.3750 0.5707 0.3785 2.2950 1.8105 0.3712 6.6891 3.8022 53.4489 67.8940 31.4484 45.3590 54.2726 66.4490 12.5467 14.7749 3.0576 4.3987 2.9406 2.1419 5.8629 12.5423 1.2279 6.9296 6.5251 253.2162 27.8373 2.0837 23.5070 11.4860 29.3025 23.9018 51.6515 45.1314 63.9939 29.6618 20.3006 143.4950 1.0456 4.8392 21.5959 10.5980 33.6008 176.8637 195.6281 182.5656 46.4612 16.1840 18.7996 7.2298 2.9799 6.8065 12.2075 31.7964 32.9230 17.6085 8.6627 27.1974 21.4555
temp: 298.150 k
press: 1.00000 atm
elementType: 16 8 8 8 7 6 6 6 6 6 6 6 1 1 1 1 1 1 1 1 1 1 1 1 1
symmnumber: 1
zpe: 510974.6 jmol-1
zpe.correction: 0.194620 hartree
zpe.thermalcorrener: 0.208086 hartree
zpe.thermalcorrenthalpy: 0.209030 hartree
zpe.thermalcorrgfe: 0.154394 hartree
zpe.sumelectzpe: -952.086624 hartree
zpe.sumelectthermal: -952.073158 hartree
zpe.sumelectthermalent: -952.072213 hartree
zpe.sumelectthermalfe: -952.126850 hartree
dipole: 3.3280 -0.5202 2.4109
dipole: 4.1423
quadrupole: -74.9911 -75.3908 -86.3115
quadrupole: 5.1089 -6.3891 -5.1120
quadrupole: 3.9067 3.5070 -7.4137 5.1089 -6.3891 -5.1120
hfenergy: -952.2812439 hartree
pointgroup: C01 [X(C7H13N1O3S1)]
dipole: -1.3104759 -0.3376015 -0.9080863 debye
dipolederiv: 0.1702425 0.0427588 0.0327621 0.1213146 -0.362601 0.0464519 0.0021716 -0.0043138 -0.2890643 -0.4885027 0.1782381 0.2103612 0.277142 -0.6846082 -0.4595748 0.1831406 -0.3849438 -0.6744266 -0.3644554 0.055128 0.1522089 -0.0276029 -0.6739929 0.234014 0.2127228 0.0517074 -0.8207136 -0.7403122 0.0312777 -0.0540225 -0.1492555 -0.5109326 -0.2701655 -0.3845549 -0.2357918 -0.7487839 -1.4089512 -0.0148169 -0.2005648 -0.1753627 -0.5090664 0.0311269 -0.1301481 0.0367195 -0.3530151 0.2017868 0.1457755 0.0046639 0.0155369 0.5677866 -0.133185 0.0466168 -0.083491 0.2522307 0.3654939 -0.1212937 0.0038115 -0.225145 0.0431698 0.0020052 -0.2030036 0.091558 0.0120708 -0.0840299 0.0135285 0.044106 0.0143837 -0.0685887 -0.010066 0.0104508 0.0256639 -0.040096 -0.0271961 -0.0174351 -0.0289716 -0.0360365 -0.0739266 0.0438943 -0.0528981 -0.0266831 -0.1091723 0.2536498 -0.3009857 -0.3947544 -0.1429174 1.2485625 0.0786874 -0.4332751 0.1105038 1.202556 1.7356842 -0.0858113 0.2532489 0.0304588 0.4634108 0.4277711 0.5952801 0.3919463 0.8372348 -0.2560178 0.1280626 0.1040019 0.2080153 -0.0837446 -0.1359822 0.1584584 -0.1383121 -0.0784937 0.1071419 0.0095819 -0.0296396 0.0455081 0.0618418 -0.0024435 0.031389 -0.0077361 0.0140568 -0.0868707 -0.0804819 -0.0077632 -0.1363119 0.007331 -0.0153423 -0.0338601 -0.0424854 0.0810618 0.0977967 0.0896961 -0.0011642 0.0875483 -0.1071197 0.038788 0.004612 0.0463257 0.0698474 0.0797517 0.0091679 -0.0725676 0.0083 0.0992138 0.0065396 -0.0226113 -0.0107805 -0.0957461 -0.087029 -0.1058786 -0.0503486 -0.1121434 0.0280867 -0.0314462 0.0027012 0.0084965 0.0878325 0.1012139 0.0629623 -0.0184489 0.0642346 -0.103224 0.0805718 -0.0141065 0.076642 0.0284148 -0.040787 0.0739401 0.1238965 0.0740651 0.071701 -0.0478732 0.0990631 -0.0275389 0.0003891 0.2148303 0.0303035 -0.0286157 0.0925402 0.2535536 -0.0543954 -0.0290767 -0.0889261 0.1473663 -0.215858 -0.1001235 -0.0181528 0.008346 0.0271129 0.0372814 -0.0433613 0.0263826 0.1445434 -0.0551636 -0.0105043 -0.0384318 -0.0512554 0.1115972 -0.0304524 -0.0830425 -0.029029 0.0782315 0.0783205 -0.0638413 0.0240881 -0.0086836 -0.0873689 -0.0044555 0.0167336 0.0154562 0.107321 0.0849889 0.0382245 -0.0325625 0.0094096 0.0909986 0.067229 0.0220906 0.0377003 -0.0998281 0.3642726 -0.0074733 0.0228592 0.0079113 0.1908074 0.1010212 0.0445075 0.1609294 0.2461829 unknown
polarizability: 117.547997|-1.5792851|114.5802842|-0.971335|0.2180905|93.2577549 unknown
InChI: InChI=1S/C7H13NO3S/c1-4(9)8-5(6(10)11)7(2,3)12/h5,8,10,12H,1-3H3
charge 0 multiplicity 1
25 atoms
S  -1.146978 -2.499171 0.472581
O  -0.866792 2.394392 0.729505
O  0.004067 1.994443 -1.384414
O  2.392342 0.2445 1.214591
N  0.917593 -0.542556 -0.394939
C  -1.569529 -0.676995 -0.057444
C  -0.238169 0.103727 0.221969
C  -2.711086 -0.154624 0.838074
C  -1.978647 -0.669834 -1.54652
C  -0.336055 1.565775 -0.262829
C  2.189389 -0.423302 0.158459
C  3.284804 -1.170444 -0.59532
H  -0.062597 0.134425 1.311443
H  -3.627409 -0.751164 0.678073
H  -2.946042 0.899257 0.6038
H  -2.438389 -0.213758 1.905072
H  -2.887517 -1.279598 -1.691569
H  -2.198314 0.358169 -1.890929
H  -1.195592 -1.087628 -2.203268
H  0.797287 -1.016679 -1.290582
H  -2.469615 -2.915983 0.440251
H  4.256531 -0.928691 -0.1416
H  3.124527 -2.262505 -0.533548
H  3.306476 -0.885951 -1.663314
H  -0.884485 3.334996 0.402358
