program: Gaussian 09
title: 000295245
version: EM64L-G09RevD.01
frameworkgroup: C1[X(C14H11Cl2NO)]
method: RPBEPBE
basis: SDD
operation: Freq
keyword: #p
keyword: freq=noraman
keyword: PBEPBE/SDD
title: #p freq=noraman PBEPBE/SDD
converged: NO YES NO NO
title: Mulliken charges:
elementType: Cl Cl O N C C C C C C C C C C C C C C H H H H H H H H H H H
charge: -0.066759 -0.080954 -0.282572 -0.457507 0.310700 0.289593 -0.318255 -0.365748 0.292951 0.178337 -0.837586 -0.235932 -0.111409 -0.245349 -0.294133 -0.231984 -0.238279 -0.217059 0.325169 0.318013 0.257160 0.244300 0.235961 0.238411 0.255218 0.292503 0.259867 0.241965 0.243379
chargesum: 0.00000
title: Mulliken charges with hydrogens summed into heavy atoms:
elementType: Cl Cl O N C C C C C C C C C C C C C C
charge: -0.066759 -0.080954 -0.282572 -0.132338 0.310700 0.289593 -0.000242 -0.108587 0.292951 0.178337 -0.118914 0.019286 -0.111409 -0.245349 -0.001630 0.027883 0.003686 0.026320
polarizability: 3.28580376e+02 1.22472073e+01 1.89403508e+02 7.70892838e-02 1.94743057e-02 7.11755576e+01
1716.lowfreq: -11.6085 -4.1629 -0.0012 -0.0011 0.0008 2.9161 5.2646 27.4838 59.0549
frequency: -8.5080 27.4821 59.0498 80.1792 105.5748 148.1387 164.5679 180.9306 201.5214 210.4872 226.1385 235.5419 277.0561 336.5332 354.5947 380.2690 414.0872 438.2412 449.7182 456.4663 484.8129 492.8134 535.6809 550.1977 619.8347 650.9748 665.6402 685.0496 695.9449 725.9559 741.8032 779.1052 779.6040 840.5406 859.0374 870.1716 874.8546 883.3269 972.7471 980.8303 992.9417 999.7047 1010.4989 1036.2460 1043.4485 1089.6539 1094.4191 1114.0340 1129.3330 1172.4790 1194.5126 1223.5934 1258.2086 1266.3556 1285.8610 1364.3266 1371.9852 1398.6760 1402.3127 1415.9048 1447.5124 1461.1202 1478.6577 1481.9425 1525.0898 1556.1939 1583.4168 1594.5784 1606.2653 1613.9306 2965.5541 3038.2779 3092.3819 3143.3034 3154.9404 3158.0148 3166.7179 3168.7382 3179.0663 3201.8449 3467.4922
redmass: 6.1346 7.1214 6.9519 8.3831 4.7414 4.4854 11.6369 2.0012 1.4256 7.0427 5.4390 5.6009 5.8830 8.3173 5.1322 9.3188 9.4613 3.3738 3.1540 4.0864 6.8701 4.3356 5.6068 3.2748 6.8713 7.1721 3.9537 1.3430 7.3034 3.2639 2.7982 5.1847 1.5312 1.3731 6.2670 1.3444 6.8676 1.3827 1.3587 1.3180 1.5703 6.5286 1.3442 2.9100 1.5194 2.1224 2.3424 1.7618 1.8193 1.0583 1.9438 2.6516 1.5748 1.5263 2.2646 7.1232 6.6835 3.3584 1.2938 2.3682 2.2715 1.9079 1.0471 1.4823 2.2292 5.4685 7.2480 5.4223 6.8935 3.4306 1.0394 1.0977 1.0962 1.0862 1.0902 1.0925 1.0950 1.0915 1.1006 1.0946 1.0771
irintensity: 2.8192 0.6189 4.1677 0.1263 0.7299 0.0680 2.6033 2.5336 0.1659 1.2020 0.0470 0.2431 0.3085 2.5390 0.8114 43.1618 8.9722 0.0795 14.6918 1.6356 2.9144 4.1137 0.2340 13.6713 0.8133 10.6971 2.2208 44.3923 17.8881 4.8220 57.3958 0.8740 45.5395 50.1031 42.7845 18.1363 37.5815 0.5655 1.8116 4.2339 8.9291 39.7696 1.1957 13.4332 7.3103 4.4750 17.5480 7.5995 6.0962 7.4171 25.2771 39.4363 36.0334 3.6977 43.5335 1.9751 73.4703 39.0479 9.1953 19.3498 61.3444 25.8569 17.0408 185.4403 394.7306 6.1897 67.3292 56.2034 24.6512 58.9482 19.1567 16.4884 21.6465 4.5131 1.5509 4.1105 9.0749 1.8858 19.1349 11.9817 125.2455
temp: 298.150 k
press: 1.00000 atm
elementType: 17 17 8 7 6 6 6 6 6 6 6 6 6 6 6 6 6 6 1 1 1 1 1 1 1 1 1 1 1
symmnumber: 1
zpe: 558566.6 jmol-1
zpe.correction: 0.212747 hartree
zpe.thermalcorrener: 0.228063 hartree
zpe.thermalcorrenthalpy: 0.229007 hartree
zpe.thermalcorrgfe: 0.169242 hartree
zpe.sumelectzpe: -1588.944802 hartree
zpe.sumelectthermal: -1588.929485 hartree
zpe.sumelectthermalent: -1588.928541 hartree
zpe.sumelectthermalfe: -1588.988306 hartree
dipole: -4.7925 2.3775 -0.0314
dipole: 5.3500
quadrupole: -109.4505 -113.2004 -123.6094
quadrupole: 4.3214 0.0585 0.0867
quadrupole: 5.9696 2.2197 -8.1893 4.3214 0.0585 0.0867
hfenergy: -1589.1575483 hartree
pointgroup: C01 [X(C14H11Cl2N1O1)]
dipole: -1.7977003 0.6957678 0.8452836 debye
polarizability: 328.6559832|-13.0565752|106.5567751|9.2255451|53.0323508|153.9466829 unknown
InChI: InChI=1S/C14H11Cl2NO/c1-9-8-10(15)6-7-13(9)17-14(18)11-4-2-3-5-12(11)16/h2-8,17H,1H3
charge 0 multiplicity 1
29 atoms
Cl 6.203661 -0.3512 -0.425818
Cl -1.772496 1.807491 2.005746
O  -0.593917 -0.765895 -1.801297
N  0.206305 0.40669 0.053092
C  1.609869 0.201428 -0.099297
C  2.468516 0.780489 0.892444
C  2.166404 -0.538803 -1.177659
C  3.864719 0.59818 0.771383
C  -2.256418 0.285751 -0.403756
C  -0.812614 -0.060264 -0.765341
C  1.916008 1.576746 2.062106
C  3.562455 -0.709209 -1.281995
C  4.393989 -0.138124 -0.3047
C  -2.801913 1.028079 0.676642
C  -3.209828 -0.242257 -1.32657
C  -4.185175 1.241047 0.843213
C  -4.59375 -0.045655 -1.186285
C  -5.090379 0.701609 -0.094361
H  -0.076119 0.962521 0.866318
H  1.499359 -0.974399 -1.921937
H  4.534363 1.032806 1.519679
H  2.733755 1.94897 2.700079
H  1.334312 2.458347 1.728495
H  1.251554 0.965451 2.704078
H  3.986058 -1.279343 -2.113415
H  -2.794368 -0.817507 -2.160252
H  -4.544184 1.820948 1.697933
H  -5.281192 -0.471808 -1.923667
H  -6.16507 0.866111 0.034144
