program: Gaussian 09
title: 000295214
version: EM64L-G09RevD.01
frameworkgroup: C1[X(C14H11ClFNO2)]
method: RPBEPBE
basis: SDD
operation: Freq
keyword: #p
keyword: freq=noraman
keyword: PBEPBE/SDD
title: #p freq=noraman PBEPBE/SDD
converged: NO YES NO NO
title: Mulliken charges:
elementType: Cl F O O N C C C C C C C C C C C C C C H H H H H H H H H H H
charge: -0.053391 -0.206102 -0.330844 -0.248673 -0.448637 0.509939 -0.392573 0.117629 0.419929 -0.419274 -0.307131 -0.322923 -0.366408 -0.342364 -0.366441 0.319103 -0.205570 -0.180855 -0.120042 0.250893 0.251069 0.358986 0.230484 0.311877 0.259369 0.249958 0.256869 0.257458 0.257856 0.259811
chargesum: 0.00000
title: Mulliken charges with hydrogens summed into heavy atoms:
elementType: Cl F O O N C C C C C C C C C C C C C C
charge: -0.053391 -0.206102 -0.330844 -0.248673 -0.089651 0.509939 0.109389 0.117629 0.419929 -0.188790 0.004746 -0.063554 -0.116450 -0.085496 -0.108983 0.319103 0.052286 0.078956 -0.120042
polarizability: 2.85711390e+02 -4.88575033e+00 1.80889850e+02 -8.18711071e-02 -1.16475220e-01 6.99959567e+01
1716.lowfreq: -5.7267 -0.0009 0.0010 0.0020 1.7675 7.2127 21.1776 33.8959 37.1678
frequency: 21.1633 33.8149 37.1661 55.6998 72.8211 125.1406 127.2002 151.0830 153.0719 191.4180 252.9025 296.8727 314.2982 317.4993 372.3195 394.5720 411.0371 415.0180 415.9156 438.8403 497.0801 506.5820 514.8577 591.7234 612.2276 623.0603 631.9541 659.6229 695.1605 714.0375 757.5683 769.7282 805.9304 808.0921 813.7732 821.7590 845.3520 849.7692 932.0210 932.7723 944.8247 951.4715 976.9758 992.3386 992.5469 1001.8111 1005.4251 1073.1990 1110.7962 1111.0897 1156.9059 1176.3026 1196.6131 1202.6947 1212.8158 1217.5713 1268.4818 1291.7748 1297.6646 1338.5192 1374.7534 1381.3313 1403.4004 1412.5054 1452.5496 1476.0657 1497.1901 1530.7701 1589.1936 1603.1435 1608.2246 1619.9267 1625.9500 2982.6511 3047.7227 3129.5584 3159.4732 3160.0312 3171.5530 3177.5163 3179.5863 3181.2737 3195.6976 3468.9203
redmass: 7.4755 3.7333 9.2318 7.7715 7.0649 7.3156 8.6549 3.2859 8.5908 4.9574 8.5601 10.1088 8.9557 7.1290 5.8861 5.7054 6.4616 3.0589 3.0124 8.8899 2.7374 6.4451 2.5672 3.4596 6.1531 7.1347 6.7913 6.9593 3.5730 3.6596 1.1523 6.2158 1.2601 6.9856 1.3097 1.5549 1.5282 5.8254 1.3435 1.3583 5.9157 1.3487 1.3119 7.0405 3.9366 2.7679 1.7918 2.6111 1.3067 1.2853 1.4809 1.1874 1.8114 1.0697 3.6557 4.2356 2.1362 1.2655 1.4001 1.4201 5.6070 6.7301 3.5558 3.9225 1.1691 2.0538 2.5819 2.3140 7.3565 6.8706 6.2628 6.3823 6.3166 1.0553 1.1066 1.0905 1.0883 1.0885 1.0908 1.0968 1.0953 1.0978 1.0962 1.0762
irintensity: 0.5138 1.1370 0.6536 0.1658 3.8445 0.8087 0.8169 13.3474 4.8480 2.1746 0.5501 2.8475 0.6217 1.3821 0.3530 2.0235 24.4158 0.0021 0.0629 0.8090 22.5021 37.6223 28.9212 0.6736 9.8290 0.8093 0.7308 43.0266 0.0027 2.1742 37.1810 27.1615 7.9554 22.2736 21.0652 102.3562 108.2782 1.0058 0.0499 1.5281 16.6872 0.0827 3.3200 24.7563 94.3798 5.8356 0.8545 47.3528 9.8944 28.0164 52.8219 58.9622 44.4283 2.1430 211.9557 122.9326 1.1955 0.5020 9.3313 1.4363 17.6992 39.6858 1.9020 25.0628 148.0926 213.3208 119.3902 542.2863 7.2439 29.3154 33.6185 5.9136 216.3251 18.8954 13.7009 12.9389 9.6529 0.7969 2.1291 4.9800 2.3715 1.0223 7.2614 117.5196
temp: 298.150 k
press: 1.00000 atm
elementType: 17 9 8 8 7 6 6 6 6 6 6 6 6 6 6 6 6 6 6 1 1 1 1 1 1 1 1 1 1 1
symmnumber: 1
zpe: 573787.2 jmol-1
zpe.correction: 0.218544 hartree
zpe.thermalcorrener: 0.235257 hartree
zpe.thermalcorrenthalpy: 0.236201 hartree
zpe.thermalcorrgfe: 0.171289 hartree
zpe.sumelectzpe: -1303.850494 hartree
zpe.sumelectthermal: -1303.833781 hartree
zpe.sumelectthermalent: -1303.832837 hartree
zpe.sumelectthermalfe: -1303.897749 hartree
dipole: -2.2345 -1.1876 0.0194
dipole: 2.5306
quadrupole: -147.7597 -110.8583 -120.8498
quadrupole: -5.8567 -0.0422 -0.0082
quadrupole: -21.2705 15.6310 5.6395 -5.8567 -0.0422 -0.0082
hfenergy: -1304.0690383 hartree
pointgroup: C01 [X(C14H11Cl1F1N1O2)]
dipole: -0.8492325 -0.0505479 -0.5172013 debye
polarizability: 285.3084278|-11.1029103|73.7982752|3.2571351|18.4611064|177.4904935 unknown
InChI: InChI=1S/C14H11ClFNO2/c15-10-1-7-13(8-2-10)19-9-14(18)17-12-5-3-11(16)4-6-12/h1-8,17H,9H2
charge 0 multiplicity 1
30 atoms
Cl -7.115897 0.304235 -1.400189
F  6.766424 -0.383409 -0.973232
O  -1.274956 0.225773 0.092645
O  1.275668 0.54156 2.66029
N  1.313887 0.129585 0.331466
C  2.703706 0.007731 0.052198
C  -0.831754 0.442676 1.476199
C  0.701277 0.376283 1.54291
C  -2.65774 0.256165 -0.177655
C  3.081452 -0.256848 -1.291886
C  3.702731 0.14074 1.054952
C  -3.649735 0.473374 0.807966
C  -3.0192 0.052351 -1.531015
C  4.439552 -0.388888 -1.642808
C  5.06346 0.009089 0.706817
C  5.404649 -0.252183 -0.63022
C  -5.012942 0.486735 0.431116
C  -4.376988 0.066084 -1.905517
C  -5.358636 0.284351 -0.916298
H  -1.242672 -0.335773 2.148157
H  -1.151681 1.438352 1.840415
H  0.660966 0.024596 -0.454622
H  2.313071 -0.360456 -2.067352
H  3.404702 0.343765 2.085058
H  -3.389359 0.632205 1.857982
H  -2.236148 -0.113792 -2.276428
H  4.746601 -0.592647 -2.672171
H  5.848671 0.107644 1.461711
H  -5.788988 0.653397 1.183401
H  -4.665622 -0.090096 -2.948491
