program: Gaussian 09
title: 000295227
version: EM64L-G09RevD.01
frameworkgroup: C1[X(C13H12ClNO2S)]
method: RPBEPBE
basis: SDD
operation: Freq
keyword: #p
keyword: freq=noraman
keyword: PBEPBE/SDD
title: #p freq=noraman PBEPBE/SDD
converged: YES YES NO NO
title: Mulliken charges:
elementType: Cl S O O N C C C C C C C C C C C C C H H H H H H H H H H H H
charge: -0.051734 0.954767 -0.527515 -0.511415 -0.546905 0.392814 -0.064321 0.529057 -0.330178 -0.394624 -0.269158 -0.375254 -0.271445 -0.219200 -0.201253 -0.206581 -0.792946 -0.216060 0.291615 0.318017 0.229556 0.237855 0.288307 0.288082 0.244163 0.244953 0.246454 0.250232 0.222595 0.240120
chargesum: 0.00000
title: Mulliken charges with hydrogens summed into heavy atoms:
elementType: Cl S O O N C C C C C C C C C C C C C
charge: -0.051734 0.954767 -0.527515 -0.511415 -0.255290 0.392814 -0.064321 0.529057 -0.012161 -0.165068 -0.269158 -0.137399 0.016863 0.068883 0.042910 0.038372 -0.073665 0.024060
polarizability: 2.53288739e+02 -1.53180314e+01 1.80149442e+02 2.19449836e+01 5.05179027e+00 1.59586527e+02
1716.lowfreq: -12.7785 -5.5073 -3.3369 -0.0020 0.0003 0.0016 11.3207 22.5640 41.7364
frequency: 10.8797 22.5002 41.6199 66.4241 77.3573 116.3849 137.3277 144.2634 169.4866 184.0067 186.4328 223.2861 240.4565 243.2021 319.6070 332.8692 360.8825 375.3354 403.5051 404.6008 435.9739 441.1863 460.7778 487.2923 504.1059 583.6313 601.4378 650.9725 672.2480 689.9468 700.8072 745.6573 758.7540 776.2035 812.7060 818.4919 851.7441 885.4762 887.6591 933.7942 942.9258 959.7686 976.6245 984.2418 992.5379 1005.8858 1006.1058 1024.9677 1043.4746 1044.3906 1078.6954 1148.3088 1173.9810 1179.6681 1204.1403 1231.6585 1246.5062 1283.8474 1304.5866 1370.0597 1383.5476 1400.7985 1408.7204 1435.3121 1451.3843 1459.0240 1470.1843 1478.2957 1554.7301 1574.6708 1601.2199 1603.7692 2984.6362 3063.3351 3095.1304 3125.4614 3138.3361 3148.0342 3148.4782 3157.2309 3166.7321 3176.1524 3180.4957 3402.4312
redmass: 7.3385 5.0598 4.2376 9.7655 5.0721 1.0827 4.0815 5.2982 6.1182 11.6570 9.2843 5.7498 5.1231 7.1636 5.3856 4.7136 6.1795 9.2336 4.3027 2.8929 5.9118 3.9296 2.7345 4.7154 5.2757 4.2524 6.4776 7.0069 6.0179 2.5147 2.9566 3.6531 1.4235 1.9105 1.5928 4.4168 1.2404 1.9138 3.4202 1.3396 1.3477 9.9708 6.2201 1.3964 1.4671 4.3563 1.3671 2.9445 2.0341 1.5219 1.5659 1.3410 1.0593 1.1206 1.7202 1.2400 6.3496 1.5859 1.2991 3.7110 8.5081 1.2603 3.0405 2.2279 2.0031 1.0451 1.1381 2.8941 5.6386 5.7630 6.8400 7.0262 1.0369 1.0969 1.0998 1.0874 1.0859 1.0888 1.0969 1.0929 1.0968 1.1013 1.0935 1.0759
irintensity: 0.6621 0.7882 0.0776 2.3700 0.7270 1.0684 1.7704 1.8344 6.9855 0.1669 2.7972 7.4304 1.0415 6.2682 1.4367 5.7555 2.8286 22.9817 11.8754 0.7764 79.3013 11.3893 9.2215 96.9330 24.6363 11.8732 0.0153 3.2694 21.5856 29.1990 4.6087 16.4041 51.9338 33.3835 45.9147 154.1817 0.3719 39.7819 12.3188 0.9955 0.0686 65.7643 4.9623 0.4231 12.9175 0.9915 0.4373 32.3350 18.6401 10.3324 4.0317 3.6544 0.2966 5.9967 2.3641 2.2905 6.7957 8.1412 3.4640 4.6083 5.7203 18.6749 11.4354 16.6822 13.1987 14.4340 13.2449 70.7457 26.6407 5.3733 0.2906 7.5278 21.8629 11.9680 17.1666 9.7290 1.3764 8.0254 13.7130 2.4967 5.4615 22.4902 3.6649 16.7856
temp: 298.150 k
press: 1.00000 atm
elementType: 17 16 8 8 7 6 6 6 6 6 6 6 6 6 6 6 6 6 1 1 1 1 1 1 1 1 1 1 1 1
symmnumber: 1
zpe: 571634.2 jmol-1
zpe.correction: 0.217724 hartree
zpe.thermalcorrener: 0.235516 hartree
zpe.thermalcorrenthalpy: 0.236460 hartree
zpe.thermalcorrgfe: 0.169203 hartree
zpe.sumelectzpe: -1564.438341 hartree
zpe.sumelectthermal: -1564.420549 hartree
zpe.sumelectthermalent: -1564.419605 hartree
zpe.sumelectthermalfe: -1564.486862 hartree
dipole: -0.0820 7.4921 3.1223
dipole: 8.1171
quadrupole: -116.8095 -124.1389 -115.3377
quadrupole: 10.9781 0.4844 -2.6995
quadrupole: 1.9525 -5.3769 3.4244 10.9781 0.4844 -2.6995
hfenergy: -1564.6560651 hartree
pointgroup: C01 [X(C13H12Cl1N1O2S1)]
dipole: 0.1131637 2.929164 -1.2671751 debye
polarizability: 249.5491985|16.2558411|180.1132346|28.2423998|-4.1093012|163.3622755 unknown
InChI: InChI=1S/C13H12ClNO2S/c1-10-7-8-11(9-13(10)14)15-18(16,17)12-5-3-2-4-6-12/h2-9,15H,1H3
charge 0 multiplicity 1
30 atoms
Cl 3.823653 -0.532051 2.035186
S  -1.616922 -1.744645 0.128725
O  -2.784854 -2.572606 -0.638546
O  -1.016009 -2.169065 1.573148
N  -0.122221 -1.847304 -1.106963
C  0.971968 -0.972616 -0.882984
C  -2.162826 0.068777 0.255647
C  3.28755 0.675164 -0.437985
C  1.747813 -1.135737 0.299887
C  1.348298 0.019974 -1.830309
C  2.859842 -0.304802 0.496397
C  2.500105 0.801547 -1.612802
C  -3.167851 0.509655 -0.621723
C  -1.548835 0.879637 1.224802
C  -3.575517 1.859847 -0.519795
C  -1.968332 2.22822 1.304793
C  4.51031 1.536479 -0.210925
C  -2.972891 2.714203 0.434737
H  -0.564343 -1.772028 -2.040057
H  1.475346 -1.907778 1.024285
H  0.750293 0.164831 -2.738176
H  2.795105 1.545646 -2.361277
H  -3.633461 -0.184607 -1.329167
H  -0.795576 0.466437 1.902831
H  -4.364606 2.238384 -1.177683
H  -1.515079 2.891024 2.048939
H  4.427065 2.113273 0.728443
H  5.423059 0.919152 -0.119274
H  4.653027 2.244626 -1.04397
H  -3.295212 3.758463 0.507618
