program: Gaussian 09
title: 000295220
version: EM64L-G09RevD.01
frameworkgroup: C1[X(C15H13Cl2NO3)]
method: RPBEPBE
basis: SDD
operation: Freq
keyword: #p
keyword: freq=noraman
keyword: PBEPBE/SDD
title: #p freq=noraman PBEPBE/SDD
converged: YES YES NO NO
title: Mulliken charges:
elementType: Cl Cl O O O N C C C C C C C C C C C C C C C H H H H H H H H H H H H H
charge: -0.061632 -0.058026 -0.294579 -0.309466 -0.249356 -0.442434 0.348991 0.161370 -0.271973 -0.453350 0.151633 -0.302344 -0.110247 0.379472 -0.254897 -0.315398 -0.370472 -0.203856 -0.181007 -0.122583 -0.526249 0.389178 0.332078 0.247649 0.269911 0.246815 0.255380 0.263748 0.260286 0.258153 0.258228 0.227445 0.247787 0.229745
chargesum: 0.00000
title: Mulliken charges with hydrogens summed into heavy atoms:
elementType: Cl Cl O O O N C C C C C C C C C C C C C C C
charge: -0.061632 -0.058026 -0.294579 -0.309466 -0.249356 -0.053256 0.348991 0.161370 0.060105 0.064210 0.151633 -0.055529 -0.110247 0.379472 0.000483 -0.051650 -0.110186 0.054297 0.077221 -0.122583 0.178728
polarizability: 2.41052375e+02 2.39185330e+01 1.96375943e+02 -1.77239604e+01 -8.68100457e+00 1.65116747e+02
1716.lowfreq: -6.9130 -0.0017 0.0006 0.0019 1.5209 3.2901 13.3899 15.7638 43.3329
frequency: 13.1763 15.7249 43.3079 62.4105 72.5818 78.5868 90.5522 104.6598 138.6538 163.3771 191.9729 198.4390 216.6017 248.6515 270.0445 289.8606 307.6005 326.1627 329.5763 355.6592 366.4973 406.4998 415.5446 452.9622 464.0920 499.7936 525.9748 548.5594 566.5049 587.9310 609.5415 618.8940 626.7066 664.6118 695.6582 726.8299 767.7245 773.1035 791.0087 806.1536 819.0072 826.8358 888.2754 908.9648 923.0687 930.3593 934.2596 953.5495 987.7643 991.4700 992.9901 1005.0076 1071.7158 1076.1788 1110.2142 1116.7701 1124.2830 1152.4320 1173.7114 1189.5290 1197.6577 1210.5651 1234.7917 1256.2950 1271.5451 1290.6452 1328.1365 1371.8213 1387.9221 1401.7018 1417.0077 1435.2660 1453.5910 1463.4545 1466.9074 1471.5362 1480.5803 1518.6101 1587.2193 1595.8360 1601.6653 1605.6105 1618.3610 2969.3145 3021.1708 3061.0592 3089.9917 3132.4641 3157.0736 3159.5998 3161.4840 3175.8076 3179.9916 3181.9701 3194.7849 3451.7065
redmass: 9.7046 7.6210 3.8967 9.8480 4.3422 6.5556 4.9891 8.7424 5.4576 6.5160 6.0297 5.2740 1.2774 3.7936 7.2341 4.5289 5.2370 6.5787 7.5065 5.0737 7.5941 5.0178 3.0883 3.6483 5.0452 2.8364 5.5833 4.0705 4.8057 4.6825 5.7815 6.9591 7.0104 5.4882 3.6784 3.5787 5.8681 6.1167 1.4881 1.2711 1.2378 1.3742 6.7098 1.3419 1.3625 5.8623 1.3569 1.3464 5.7245 4.6452 7.2082 2.1601 2.5419 1.9658 1.3198 1.2580 1.7792 1.4495 1.3929 1.8251 2.3237 2.6329 1.3527 1.8206 1.7941 1.2576 1.2697 6.5142 8.2291 3.6452 3.0590 1.3866 1.0967 1.5932 1.0534 1.8735 1.4587 2.7363 7.1652 5.3677 7.3485 6.9259 8.1038 1.0325 1.0580 1.1046 1.1060 1.1002 1.0885 1.0885 1.0880 1.0967 1.0978 1.0967 1.0937 1.0759
irintensity: 0.9218 0.9917 0.3590 4.7254 0.1448 1.9708 0.2428 0.1381 6.6384 3.1446 1.2999 6.5085 0.0348 3.7746 6.1218 4.2230 4.2297 8.3954 0.1132 0.9352 0.7877 2.4782 0.3108 12.5444 43.6650 16.5050 5.3177 7.4385 8.4911 2.8041 47.1221 22.1079 3.6955 6.3138 0.3060 0.6241 0.4350 2.3103 39.0876 34.9041 101.3660 82.2061 76.5038 7.6406 24.6070 7.0632 0.5122 0.4601 14.0053 62.7407 66.8540 4.0022 40.0353 1.0380 8.1538 0.5465 69.5618 8.1248 93.7717 88.7751 53.5638 33.0833 95.1274 69.9591 11.8408 1.2523 4.9582 6.0576 0.5312 0.5722 95.5941 3.8531 38.9119 128.4125 17.5258 245.2130 37.2099 485.7987 8.5930 15.6082 44.6575 114.3102 121.1767 59.6048 21.2618 38.9216 7.6961 15.9630 6.0190 1.9261 5.5062 3.5772 1.0552 2.9712 12.0465 77.8209
temp: 298.150 k
press: 1.00000 atm
elementType: 17 17 8 8 8 7 6 6 6 6 6 6 6 6 6 6 6 6 6 6 6 1 1 1 1 1 1 1 1 1 1 1 1 1
symmnumber: 1
zpe: 653231.2 jmol-1
zpe.correction: 0.248803 hartree
zpe.thermalcorrener: 0.268538 hartree
zpe.thermalcorrenthalpy: 0.269482 hartree
zpe.thermalcorrgfe: 0.197205 hartree
zpe.sumelectzpe: -1778.421879 hartree
zpe.sumelectthermal: -1778.402144 hartree
zpe.sumelectthermalent: -1778.401200 hartree
zpe.sumelectthermalfe: -1778.473477 hartree
dipole: 1.1485 4.3696 -3.2311
dipole: 5.5545
quadrupole: -154.4521 -124.0777 -134.2553
quadrupole: -14.4818 -1.9495 -4.5595
quadrupole: -16.8570 13.5173 3.3397 -14.4818 -1.9495 -4.5595
hfenergy: -1778.670682 hartree
pointgroup: C01 [X(C15H13Cl2N1O3)]
dipole: 0.2394619 -0.7368454 2.0433497 debye
polarizability: 218.0762413|5.1488962|161.6536523|-35.1162867|0.8390408|222.815171 unknown
InChI: InChI=1S/C15H13Cl2NO3/c1-20-14-7-4-11(17)8-13(14)18-15(19)9-21-12-5-2-10(16)3-6-12/h2-8,18H,9H2,1H3
charge 0 multiplicity 1
34 atoms
Cl 4.760011 1.056052 -3.319047
Cl -4.790302 2.653522 2.003238
O  -1.806606 -2.127856 -0.155098
O  1.792784 -0.918711 1.529789
O  0.146559 -1.208368 -3.132045
N  0.691798 -1.228038 -0.835751
C  1.958357 -0.596097 -0.822084
C  2.563798 -0.424139 0.462854
C  2.632306 -0.142111 -1.979982
C  -1.42588 -2.224023 -1.571223
C  -0.119153 -1.483941 -1.923744
C  3.823223 0.192991 0.584423
C  3.890289 0.471173 -1.825308
C  -2.495148 -0.965591 0.267885
C  4.500184 0.649235 -0.572757
C  -2.665419 0.196344 -0.522435
C  -3.017888 -1.028009 1.58159
C  -3.370213 1.300668 0.011369
C  -3.715709 0.073887 2.114073
C  -3.884163 1.226071 1.317914
C  2.31842 -0.757888 2.887437
H  0.333078 -1.508936 0.086835
H  2.168865 -0.273892 -2.959069
H  -2.227475 -1.862676 -2.240028
H  -1.279552 -3.303446 -1.748602
H  4.290699 0.327538 1.563561
H  5.478068 1.130508 -0.490508
H  -2.254355 0.27159 -1.533247
H  -2.877153 -1.941509 2.166524
H  -3.506671 2.205289 -0.58798
H  -4.126295 0.033724 3.126939
H  3.274615 -1.301566 3.008934
H  1.554795 -1.194304 3.547107
H  2.459033 0.311912 3.132634
