program: Gaussian 09
title: 000295210
version: EM64L-G09RevD.01
frameworkgroup: C1[X(C15H13Cl2NO2)]
method: RPBEPBE
basis: SDD
operation: Freq
keyword: #p
keyword: freq=noraman
keyword: PBEPBE/SDD
title: #p freq=noraman PBEPBE/SDD
converged: NO YES NO NO
title: Mulliken charges:
elementType: Cl Cl O O N C C C C C C C C C C C C C C C H H H H H H H H H H H H H
charge: -0.065096 -0.053239 -0.334723 -0.241986 -0.454879 0.352428 0.267271 -0.360647 -0.202300 -0.788321 -0.398005 0.112003 -0.222627 -0.260141 0.424978 -0.323390 -0.365311 -0.205668 -0.181817 -0.120393 0.354049 0.311488 0.209726 0.261784 0.261865 0.251188 0.251167 0.236000 0.258681 0.260078 0.248047 0.257865 0.259925
chargesum: 0.00000
title: Mulliken charges with hydrogens summed into heavy atoms:
elementType: Cl Cl O O N C C C C C C C C C C C C C C C
charge: -0.065096 -0.053239 -0.334723 -0.241986 -0.100830 0.352428 0.267271 -0.049158 -0.202300 -0.054946 0.104350 0.112003 0.013373 -0.001460 0.424978 -0.063312 -0.117264 0.052197 0.078108 -0.120393
polarizability: 3.01846360e+02 1.47145140e+00 2.19857839e+02 2.08354950e-01 -2.22941143e-01 8.12178426e+01
1716.lowfreq: -116.3821 -2.1226 -1.6798 0.0019 0.0019 0.0023 8.3428 20.9331 25.8874
frequency: -116.3778 20.7931 25.8637 32.7522 52.5728 64.0554 117.6784 118.7269 141.6371 156.9182 159.1037 214.8690 234.3614 256.4971 289.5900 298.1305 318.8754 332.8262 371.8936 413.7249 414.9568 445.4425 477.1284 496.4199 503.7747 528.9760 552.8356 577.5906 598.2491 624.1753 648.0823 694.4822 713.1790 714.1911 770.2339 788.9582 793.8262 804.8783 809.9771 821.1107 852.2708 914.4769 931.1852 947.5849 950.6446 991.4461 991.5706 992.1435 1004.5016 1005.0024 1034.3999 1073.1888 1074.0063 1110.6047 1141.0916 1176.3706 1198.7098 1204.7149 1205.3027 1215.4585 1226.7101 1290.9862 1296.7310 1339.0057 1364.6102 1376.0624 1403.7764 1409.1922 1429.4068 1451.7439 1452.7405 1460.0008 1475.0802 1478.9584 1525.6388 1584.9881 1589.1868 1605.2783 1609.6772 1632.4516 2983.0819 2993.6135 3048.3636 3070.6302 3094.1704 3149.8354 3158.0877 3160.1000 3177.7252 3179.0453 3181.0729 3192.1353 3483.8827
redmass: 1.0434 6.2790 3.9129 10.1454 6.7662 7.0567 8.7367 5.1517 5.9681 2.6687 7.7355 4.0540 9.3978 8.8204 5.8344 4.0369 7.0395 5.8526 8.0190 6.3165 2.9927 8.1403 4.0851 2.7257 3.3995 5.6731 4.4991 5.5171 3.7069 7.0509 8.6213 3.5511 2.4349 5.5454 1.1877 4.9856 1.5309 1.2640 6.6159 1.5671 5.2635 1.3594 1.3389 3.7538 1.3501 1.3460 5.5014 3.9652 1.8014 2.0081 1.4835 2.3969 2.2992 1.3049 1.8913 1.1815 1.6240 1.0737 2.3148 3.9201 2.2753 1.2788 2.0853 1.4243 7.0453 5.4445 3.5967 1.2965 2.6541 1.3082 1.9151 1.0427 1.8429 1.3599 2.4577 4.1656 7.0308 6.6091 6.3509 5.5210 1.0554 1.0379 1.1067 1.0979 1.0971 1.0886 1.0887 1.0883 1.0967 1.0949 1.0976 1.0966 1.0751
irintensity: 1.1116 0.0540 0.0436 0.2457 1.6761 3.1173 1.4084 0.7874 0.8016 13.5569 6.3106 2.5457 0.1781 0.9275 2.6655 4.2229 3.0383 0.0556 11.0669 13.3487 0.0606 2.3944 0.7155 23.0787 0.0913 16.0159 0.0827 19.5971 0.0012 0.2910 67.8549 0.0060 30.2286 13.6185 25.3630 0.2136 80.7800 8.0730 6.8007 93.9720 21.9011 3.9279 0.0914 15.5009 0.0335 5.9664 75.8467 41.3052 2.4230 63.7265 7.1053 61.5473 1.8108 16.0554 10.6537 55.9009 9.4166 2.5569 16.2236 315.4565 0.8135 1.4843 10.6391 1.2431 15.1036 7.7747 2.5749 20.4512 197.6437 81.5800 31.1500 13.0340 215.6070 24.3556 332.7192 337.9505 8.9174 26.4995 9.9978 197.3223 18.5822 18.9783 13.0962 9.1533 35.7302 9.1298 6.2841 5.2310 4.9604 2.9954 0.6703 10.5925 104.6011
temp: 298.150 k
press: 1.00000 atm
elementType: 17 17 8 8 7 6 6 6 6 6 6 6 6 6 6 6 6 6 6 6 1 1 1 1 1 1 1 1 1 1 1 1 1
symmnumber: 1
zpe: 641724.6 jmol-1
zpe.correction: 0.244420 hartree
zpe.thermalcorrener: 0.262507 hartree
zpe.thermalcorrenthalpy: 0.263452 hartree
zpe.thermalcorrgfe: 0.195069 hartree
zpe.sumelectzpe: -1703.296852 hartree
zpe.sumelectthermal: -1703.278765 hartree
zpe.sumelectthermalent: -1703.277821 hartree
zpe.sumelectthermalfe: -1703.346204 hartree
dipole: 1.0552 -0.4641 0.0175
dipole: 1.1529
quadrupole: -142.5314 -132.6894 -134.9553
quadrupole: 3.8819 0.1253 -0.0539
quadrupole: -5.8060 4.0360 1.7701 3.8819 0.1253 -0.0539
hfenergy: -1703.5412724 hartree
pointgroup: C01 [X(C15H13Cl2N1O2)]
dipole: -0.4019952 -0.0997758 0.1848626 debye
polarizability: 299.420987|22.6069439|93.047427|3.1281364|-34.6868142|210.4536277 unknown
InChI: InChI=1S/C15H13Cl2NO2/c1-10-13(17)3-2-4-14(10)18-15(19)9-20-12-7-5-11(16)6-8-12/h2-8,18H,9H2,1H3
charge 0 multiplicity 1
33 atoms
Cl 5.304017 -0.309572 2.601322
Cl -6.936397 -1.303765 1.510395
O  -1.28965 -0.242958 -0.316228
O  0.968474 0.730949 -2.989723
N  1.248592 0.139365 -0.708713
C  2.652385 0.242597 -0.499558
C  3.169475 -0.059576 0.804578
C  3.517462 0.63514 -1.557115
C  4.570512 0.058976 0.960622
C  2.308834 -0.486565 1.981805
C  -0.991647 0.161274 -1.696981
C  0.522582 0.370463 -1.860334
C  4.903313 0.732388 -1.333028
C  5.451758 0.444173 -0.064539
C  -2.634306 -0.474196 0.036543
C  -3.718368 -0.34376 -0.86364
C  -2.855997 -0.856104 1.381412
C  -5.033214 -0.59852 -0.409275
C  -4.165942 -1.109615 1.833099
C  -5.24034 -0.976815 0.928633
H  0.665313 -0.141854 0.086269
H  3.086758 0.856089 -2.535149
H  1.232345 -0.550586 1.754962
H  2.425874 0.218884 2.824059
H  2.625458 -1.477714 2.35342
H  -1.313458 -0.619677 -2.413015
H  -1.501628 1.111906 -1.946691
H  5.563789 1.03504 -2.151889
H  6.525856 0.515305 0.124231
H  -3.56554 -0.049832 -1.905596
H  -2.003545 -0.950844 2.060483
H  -5.879646 -0.501188 -1.094739
H  -4.34682 -1.405012 2.87028
