program: Gaussian 09
title: 000295209
version: EM64L-G09RevD.01
frameworkgroup: C1[X(C16H16ClNO2)]
method: RPBEPBE
basis: SDD
operation: Freq
keyword: #p
keyword: freq=noraman
keyword: PBEPBE/SDD
title: #p freq=noraman PBEPBE/SDD
converged: YES YES NO NO
title: Mulliken charges:
elementType: Cl O O N C C C C C C C C C C C C C C C C H H H H H H H H H H H H H H H H
charge: -0.056005 -0.299769 -0.249312 -0.453940 0.287799 0.315163 0.469717 -0.532180 -0.340975 -0.440985 -0.847881 -0.813767 0.146517 -0.460613 0.371703 -0.312878 -0.372712 -0.203675 -0.180131 -0.123648 0.232292 0.301882 0.232407 0.375376 0.229728 0.237114 0.243628 0.230015 0.226076 0.228275 0.268392 0.247579 0.265905 0.261082 0.258508 0.259313
chargesum: 0.00000
title: Mulliken charges with hydrogens summed into heavy atoms:
elementType: Cl O O N C C C C C C C C C C C C C C C C
charge: -0.056005 -0.299769 -0.249312 -0.078564 0.287799 0.315163 0.469717 -0.299888 -0.039094 -0.208578 -0.137411 -0.129401 0.146517 0.055359 0.371703 -0.046973 -0.111629 0.054832 0.079182 -0.123648
polarizability: 2.37577225e+02 3.55275625e-01 1.88977408e+02 -1.54784238e+01 -1.16227155e+01 1.68818801e+02
1716.lowfreq: -8.8796 0.0012 0.0013 0.0015 1.3116 5.9458 15.3735 20.4310 40.6261
frequency: 15.0540 20.3546 40.6208 41.4860 58.9812 73.9079 85.8230 126.7761 167.1114 184.9002 196.8609 206.9461 211.6756 262.6894 288.5359 291.5449 324.7472 329.2115 364.4760 404.9304 415.0363 429.2597 444.7414 461.7838 499.7681 534.3240 542.8573 564.7461 576.7022 603.6520 624.4066 634.6983 695.6163 712.8269 727.8143 755.3776 768.2941 808.9317 823.3809 830.6462 845.3736 888.2220 904.8672 934.7102 944.0355 953.0817 976.6702 982.1785 984.5445 990.7425 1003.7234 1016.7279 1041.6896 1049.5696 1072.1427 1110.4616 1124.9406 1172.0950 1174.0603 1189.3921 1207.6816 1232.1231 1234.9371 1291.0551 1291.1923 1300.9655 1325.4129 1371.1444 1373.0716 1396.2124 1398.8102 1401.6913 1415.1702 1454.2121 1460.1249 1471.0500 1472.4901 1476.4593 1481.4972 1501.3716 1526.7918 1586.9652 1597.9112 1603.7517 1622.8735 1628.0761 2956.6011 2974.8589 3023.1272 3026.5169 3051.5364 3084.1274 3086.9199 3092.5489 3114.6840 3132.7319 3156.4862 3158.6547 3175.5054 3179.2645 3188.7885 3485.4775
redmass: 7.6781 3.9960 3.1632 1.0931 7.0507 6.0823 6.2335 5.7132 2.6574 1.8836 5.5447 4.1275 1.8606 3.4829 4.3133 3.5852 6.3680 6.9548 3.8254 5.1502 3.0586 4.6132 3.0167 3.5971 2.8371 5.2120 3.9368 4.3825 3.4169 5.6508 6.4557 5.0642 3.7162 5.5791 2.3466 1.3443 5.9610 1.2598 1.5461 4.7850 1.3315 1.2966 4.3943 1.3274 4.5843 1.3495 1.5185 1.3550 5.9242 3.7434 2.1387 1.5022 1.5164 1.5586 2.5474 1.3237 2.1221 1.5800 1.4424 1.6905 3.1653 1.3819 1.7671 1.2602 2.6487 1.6683 1.2691 6.3593 5.3533 1.2577 1.2747 3.5861 3.1812 1.1503 1.5072 1.0460 2.0831 1.1278 1.0459 1.6762 2.2029 7.1311 5.5458 6.0336 5.4800 6.7500 1.0397 1.0374 1.0580 1.0979 1.0976 1.0983 1.0953 1.1063 1.0912 1.0909 1.0886 1.0886 1.0967 1.0979 1.0945 1.0751
irintensity: 0.0398 0.8017 0.5162 0.2313 4.1276 2.1547 0.5628 0.5956 3.0026 1.7137 3.5856 11.6685 0.9590 1.5602 1.6672 3.7558 6.7153 0.8551 1.5254 3.4711 0.4880 21.3516 7.2107 9.2285 19.8013 0.3705 2.1466 0.1291 20.2492 28.9088 9.2259 9.5169 0.2933 0.2013 13.8194 81.9713 0.6230 10.0408 88.6843 1.9544 51.3038 0.8516 4.8595 0.3956 25.6087 0.6593 11.9922 3.3235 32.6852 59.2093 2.7852 4.5732 1.6181 16.1748 40.2678 10.5372 3.6481 22.6790 89.1689 62.2734 21.3727 87.7354 4.1323 1.6020 4.2546 21.4243 3.8630 10.2006 18.9611 8.1093 17.7386 0.2029 3.3927 81.8241 101.2683 13.5588 169.7227 27.3866 12.7515 26.0453 361.4694 8.4328 30.2257 38.8144 184.8300 17.2033 28.9437 44.4944 22.5066 19.6573 22.0960 18.2720 17.0081 7.7836 22.9895 18.2322 5.5591 1.8692 3.3105 0.7327 4.0283 50.3719
temp: 298.150 k
press: 1.00000 atm
elementType: 17 8 8 7 6 6 6 6 6 6 6 6 6 6 6 6 6 6 6 6 1 1 1 1 1 1 1 1 1 1 1 1 1 1 1 1
symmnumber: 1
zpe: 738823.2 jmol-1
zpe.correction: 0.281403 hartree
zpe.thermalcorrener: 0.300584 hartree
zpe.thermalcorrenthalpy: 0.301528 hartree
zpe.thermalcorrgfe: 0.230655 hartree
zpe.sumelectzpe: -1283.136460 hartree
zpe.sumelectthermal: -1283.117279 hartree
zpe.sumelectthermalent: -1283.116334 hartree
zpe.sumelectthermalfe: -1283.187208 hartree
dipole: 0.6290 -0.8846 2.7058
dipole: 2.9154
quadrupole: -127.6975 -127.0041 -119.5674
quadrupole: -12.5632 -1.6891 0.7611
quadrupole: -2.9411 -2.2478 5.1889 -12.5632 -1.6891 0.7611
hfenergy: -1283.4178626 hartree
pointgroup: C01 [X(C16H16Cl1N1O2)]
dipole: -0.3096376 -0.4892089 0.9901718 debye
polarizability: 234.566057|2.6639046|167.4339862|16.4399166|14.166849|193.3733909 unknown
InChI: InChI=1S/C16H16ClNO2/c1-11-3-8-15(12(2)9-11)18-16(19)10-20-14-6-4-13(17)5-7-14/h3-9,18H,10H2,1-2H3
charge 0 multiplicity 1
36 atoms
Cl 4.462542 3.69537 1.412539
O  1.787949 -1.470369 -0.200096
O  -0.496133 -0.914363 -3.029488
N  -0.828337 -0.850149 -0.684826
C  -2.651229 -0.139368 0.780247
C  -2.153129 -0.338306 -0.545882
C  -4.795495 0.670168 -0.173934
C  -3.96297 0.359024 0.932706
C  -2.96453 -0.034093 -1.667146
C  -4.269686 0.46457 -1.4716
C  -1.796877 -0.451965 1.998515
C  -6.19975 1.208734 0.037845
C  -0.105102 -1.09014 -1.836292
C  1.296103 -1.684399 -1.57171
C  2.393714 -0.224698 0.096089
C  2.37456 0.898172 -0.76572
C  3.035408 -0.156458 1.355814
C  3.010538 2.094624 -0.359693
C  3.664567 1.037516 1.761209
C  3.645369 2.149621 0.893775
H  -4.348824 0.511794 1.949105
H  -2.566358 -0.1908 -2.671492
H  -4.886956 0.69562 -2.347842
H  -0.318707 -1.056762 0.18126
H  -1.51305 -1.522669 2.048015
H  -0.862221 0.144108 2.018222
H  -2.345235 -0.221393 2.926479
H  -6.18426 2.179602 0.56891
H  -6.720744 1.36158 -0.922761
H  -6.811502 0.51608 0.646209
H  1.245285 -2.781318 -1.68085
H  1.998294 -1.286086 -2.325441
H  1.867888 0.872727 -1.734859
H  3.042177 -1.041555 1.998685
H  3.000327 2.96995 -1.015173
H  4.166076 1.098032 2.731185
