program: Gaussian 09
title: 000295212
version: EM64L-G09RevD.01
frameworkgroup: C1[X(C15H13Cl2NO2)]
method: RPBEPBE
basis: SDD
operation: Freq
keyword: #p
keyword: freq=noraman
keyword: PBEPBE/SDD
title: #p freq=noraman PBEPBE/SDD
converged: YES YES NO NO
title: Mulliken charges:
elementType: Cl Cl O O N C C C C C C C C C C C C C C C H H H H H H H H H H H H H
charge: -0.063172 -0.052025 -0.300989 -0.245180 -0.459524 0.325637 0.303355 -0.329143 -0.364751 -0.838902 -0.458744 0.152742 -0.231936 -0.110268 0.370742 -0.313025 -0.372781 -0.202507 -0.178807 -0.124909 0.378472 0.309543 0.258582 0.247617 0.240435 0.234329 0.249973 0.271380 0.256973 0.264408 0.262249 0.259646 0.260579
chargesum: 0.00000
title: Mulliken charges with hydrogens summed into heavy atoms:
elementType: Cl Cl O O N C C C C C C C C C C C C C C C
charge: -0.063172 -0.052025 -0.300989 -0.245180 -0.081052 0.325637 0.303355 -0.019600 -0.106169 -0.116520 0.062609 0.152742 0.025037 -0.110268 0.370742 -0.048616 -0.110532 0.057139 0.081772 -0.124909
polarizability: 2.41038882e+02 3.20576258e+00 1.86203610e+02 1.69878852e+01 -1.22550231e+01 1.62801139e+02
1716.lowfreq: -3.9412 -2.7338 0.0008 0.0015 0.0022 4.1778 13.2812 16.8603 44.1709
frequency: 13.2478 16.6193 44.1336 56.1724 69.9146 83.5653 120.1553 153.6168 181.3170 188.8636 200.8553 202.4517 235.2232 267.0729 286.7704 322.5605 328.5627 356.3118 372.9136 410.3751 416.5142 432.4308 446.0645 500.4968 516.2200 536.6461 554.6908 560.6406 584.5102 615.5104 627.3550 674.0227 696.8782 716.0911 752.3146 767.9505 810.1180 818.5195 825.1077 841.2448 856.7006 871.8877 927.6854 935.7905 954.4482 976.5177 984.7838 989.4693 991.0131 1003.5475 1041.9785 1072.6797 1089.9828 1110.4840 1119.4860 1172.9174 1187.5363 1194.7693 1207.7184 1230.8038 1267.0809 1290.8910 1293.6226 1324.0470 1371.1890 1373.4839 1397.8886 1400.7432 1401.4915 1449.6400 1455.6342 1471.3107 1480.2010 1485.6005 1523.2935 1586.2514 1589.8044 1602.2879 1610.7438 1624.2513 2961.4184 3023.4453 3032.8439 3092.8309 3092.9779 3157.0153 3159.5258 3159.5747 3169.0410 3176.0521 3180.0129 3192.4590 3481.4453
redmass: 12.1355 4.2511 4.4741 7.0634 8.6841 8.2092 7.7180 3.4491 2.4602 6.1238 3.2480 1.8362 4.6704 6.3127 4.3085 6.2295 7.2808 5.0463 9.4089 4.7484 3.2278 3.9776 3.0735 2.8782 5.1482 3.9715 4.8533 4.3555 4.4993 5.9923 6.8590 6.2676 3.7420 2.8421 1.2764 5.9379 1.2683 4.6775 1.5477 1.3727 6.3734 1.3417 6.3835 1.3261 1.3462 1.3203 4.6940 1.7219 3.7490 2.1833 1.5197 2.5573 1.9846 1.3281 1.9424 1.4890 1.6924 2.0956 2.7334 1.3798 1.5167 1.2644 1.9746 1.2698 6.6416 6.5499 1.2769 3.6975 3.5773 1.1203 1.6430 2.3208 1.0512 1.5157 2.0699 6.8963 6.0589 6.7878 5.9893 5.9259 1.0398 1.0580 1.0981 1.1047 1.0971 1.0886 1.0925 1.0887 1.0907 1.0968 1.0979 1.0960 1.0753
irintensity: 0.2536 1.0563 0.4461 0.5500 6.1802 0.3422 0.1613 1.4553 1.7982 4.5739 5.8083 0.3535 1.6157 1.7028 3.5900 3.3009 2.8027 6.7947 40.9314 5.3561 0.7288 2.5251 7.9189 18.8464 2.3949 2.7810 6.1538 4.9162 23.1585 24.0214 0.3141 23.7205 0.3602 7.3868 90.7141 0.7835 13.9701 37.1009 68.0226 50.0648 22.9012 17.2437 37.8595 0.9852 0.5239 3.1090 22.2075 15.5527 66.9287 2.8770 6.3653 41.4665 13.8440 10.0116 10.0026 106.8414 32.6597 46.1767 19.0800 88.0345 2.2840 2.0514 17.2893 4.3172 12.2312 32.3629 13.7074 36.1052 7.3779 52.8494 67.1304 216.6601 14.6016 123.2586 360.7842 15.7601 24.8973 21.9055 20.4508 187.4387 22.5894 20.4246 16.8906 12.3984 10.1777 5.7424 2.7891 1.9518 1.6099 3.0029 0.7883 6.5117 56.8284
temp: 298.150 k
press: 1.00000 atm
elementType: 17 17 8 8 7 6 6 6 6 6 6 6 6 6 6 6 6 6 6 6 1 1 1 1 1 1 1 1 1 1 1 1 1
symmnumber: 1
zpe: 642408.6 jmol-1
zpe.correction: 0.244681 hartree
zpe.thermalcorrener: 0.263287 hartree
zpe.thermalcorrenthalpy: 0.264232 hartree
zpe.thermalcorrgfe: 0.194544 hartree
zpe.sumelectzpe: -1703.297386 hartree
zpe.sumelectthermal: -1703.278779 hartree
zpe.sumelectthermalent: -1703.277835 hartree
zpe.sumelectthermalfe: -1703.347522 hartree
dipole: 2.0054 0.7638 3.0013
dipole: 3.6896
quadrupole: -150.5902 -135.8454 -123.4534
quadrupole: 3.5769 1.0286 -0.3357
quadrupole: -13.9605 0.7843 13.1762 3.5769 1.0286 -0.3357
hfenergy: -1703.5420664 hartree
pointgroup: C01 [X(C15H13Cl2N1O2)]
dipole: -0.6405883 1.2164914 -0.4657312 debye
polarizability: 235.6938166|-23.4340522|162.1486151|11.6485116|3.0906686|192.2011998 unknown
InChI: InChI=1S/C15H13Cl2NO2/c1-10-8-12(17)4-7-14(10)18-15(19)9-20-13-5-2-11(16)3-6-13/h2-8,18H,9H2,1H3
charge 0 multiplicity 1
33 atoms
Cl 5.971133 -1.974619 -0.939581
Cl -5.131391 -1.703267 -2.254419
O  -1.513009 2.065189 0.768351
O  0.643307 0.222822 3.108799
N  0.932034 0.863023 0.84749
C  2.123247 0.18378 0.46186
C  2.558889 0.329721 -0.893379
C  2.860336 -0.613796 1.375873
C  3.737352 -0.337578 -1.297625
C  1.781995 1.176127 -1.887727
C  -0.988583 1.724884 2.100515
C  0.278135 0.84249 2.066005
C  4.033567 -1.273484 0.954038
C  4.455534 -1.125544 -0.37841
C  -2.349574 1.118139 0.125248
C  -2.533748 -0.214151 0.566284
C  -3.004747 1.592467 -1.035912
C  -3.387655 -1.073481 -0.164014
C  -3.85107 0.733828 -1.765408
C  -4.032939 -0.591054 -1.316563
H  0.464445 1.42916 0.130637
H  2.508738 -0.711688 2.404589
H  4.088973 -0.241735 -2.329299
H  2.261195 1.151382 -2.879556
H  0.743093 0.813558 -2.020117
H  1.731621 2.239162 -1.578265
H  -1.749724 1.227885 2.727653
H  -0.734058 2.696232 2.558143
H  4.603358 -1.888725 1.655868
H  -2.022786 -0.604541 1.451123
H  -2.851611 2.629637 -1.348116
H  -3.537352 -2.105853 0.164212
H  -4.364805 1.09213 -2.661896
