program: Gaussian 09
title: 000295208
version: EM64L-G09RevD.01
frameworkgroup: C1[X(C16H16ClNO2)]
method: RPBEPBE
basis: SDD
operation: Freq
keyword: #p
keyword: freq=noraman
keyword: PBEPBE/SDD
title: #p freq=noraman PBEPBE/SDD
converged: YES YES NO NO
title: Mulliken charges:
elementType: Cl O O N C C C C C C C C C C C C C C C C H H H H H H H H H H H H H H H H
charge: -0.056591 -0.324270 -0.236079 -0.467334 0.168966 0.338103 0.362555 -0.420687 -0.412512 -0.231566 -0.830023 -0.823510 0.108209 -0.394341 0.417848 -0.324216 -0.367903 -0.206149 -0.182063 -0.120047 0.355954 0.233120 0.233416 0.226266 0.224108 0.244906 0.235322 0.287810 0.217800 0.220291 0.246959 0.249140 0.260211 0.250866 0.256737 0.258703
chargesum: 0.00000
title: Mulliken charges with hydrogens summed into heavy atoms:
elementType: Cl O O N C C C C C C C C C C C C C C C C
charge: -0.056591 -0.324270 -0.236079 -0.111380 0.168966 0.338103 0.362555 -0.187567 -0.179096 -0.005301 -0.125687 -0.097608 0.108209 0.101759 0.417848 -0.064005 -0.117038 0.050588 0.076640 -0.120047
polarizability: 2.93593249e+02 2.31707951e+00 1.90002552e+02 -8.25925061e+00 -3.82334939e+00 1.11141995e+02
1716.lowfreq: -5.6130 0.0008 0.0011 0.0014 3.1263 6.9968 18.7473 27.7695 37.7699
frequency: 18.4028 27.7247 37.7620 55.3321 86.0743 97.1122 125.4687 133.3574 145.9163 151.1218 172.2273 197.8186 229.8160 251.3326 274.8841 307.0802 312.9652 318.8783 325.1799 415.7115 419.6924 435.8055 470.0017 497.4725 512.0365 517.5082 518.3316 537.3358 597.6182 601.8348 623.4389 650.3345 694.8365 703.6659 717.7348 748.0194 778.6906 805.0780 806.3780 822.1791 851.2205 900.2346 917.3104 932.1833 946.5179 951.8205 975.9355 987.8570 990.6074 991.9695 1002.2599 1040.9462 1044.9306 1053.7201 1073.2133 1097.6773 1111.2139 1176.6472 1178.0499 1199.7617 1204.8217 1215.4699 1248.2394 1262.7630 1281.8051 1291.9731 1337.9499 1370.6091 1375.2580 1399.1182 1400.1165 1404.4019 1438.8072 1448.9048 1455.2067 1459.3552 1469.7413 1475.3659 1483.3693 1487.3698 1509.1215 1587.9689 1603.3481 1604.0611 1606.8990 1635.6244 2964.3659 2978.4554 2982.0490 3042.4206 3049.4142 3059.9742 3088.0774 3090.3071 3122.9566 3133.3339 3157.7349 3158.1657 3159.8463 3176.8793 3180.2451 3470.8030
redmass: 5.7845 3.9746 6.0976 6.1298 5.6750 4.1429 6.6017 8.0207 1.1641 2.2844 2.0672 1.5673 2.5621 6.5037 4.0331 4.6933 3.9364 4.9175 4.4085 3.0062 7.4823 5.5574 3.3482 2.7391 5.0323 3.1156 4.4436 4.2481 3.5706 4.4316 7.0423 7.6136 3.3030 1.7713 2.0476 4.7308 1.2193 6.5523 1.2704 1.5638 5.0597 1.3081 3.1604 1.3361 3.5561 1.3484 1.3621 2.2648 3.0088 3.9551 1.8192 1.6277 1.7333 1.5901 2.6138 1.7034 1.3079 1.1899 1.1642 2.8698 1.2750 3.9287 2.4057 1.7769 2.3510 1.2720 1.4235 6.4492 5.3730 1.2536 1.2489 3.6029 2.1310 1.2022 1.7282 1.0893 1.0730 2.0568 1.3805 1.2314 1.9679 7.3688 6.6307 5.8689 6.2633 7.3709 1.0416 1.0365 1.0559 1.0928 1.1061 1.0968 1.0997 1.0982 1.0857 1.0919 1.0995 1.0886 1.0882 1.0968 1.0976 1.0756
irintensity: 0.1244 0.3011 0.6300 0.5852 2.1962 1.1139 1.2349 1.2591 2.8591 7.0259 9.9145 3.4951 0.9546 0.9202 1.6408 3.7510 2.0904 0.7976 1.9290 0.0682 13.4922 1.7738 0.8287 22.4309 15.2218 0.2418 6.2476 3.0072 2.9692 2.0028 0.1563 68.9136 1.7791 31.1164 54.7159 3.7947 56.5411 7.4881 8.0486 86.5216 6.6672 0.0884 2.7347 0.1483 36.1371 0.0859 3.3025 15.8400 55.0927 35.9482 1.5753 7.1984 2.3516 8.6561 43.4095 15.1631 16.2076 61.8921 1.5644 2.8930 1.5984 317.7809 8.0051 2.9782 7.9499 0.7825 1.5197 17.6392 6.9811 28.6886 4.6273 1.7987 6.9636 145.0854 11.4940 32.4075 13.7821 269.2082 65.4764 16.1530 271.8427 8.6846 15.3379 27.7355 3.2278 205.0333 33.1628 24.2682 19.2332 19.5016 13.2338 12.5439 21.7420 23.1286 0.1494 24.5724 36.9112 3.9455 4.0490 5.7536 0.9052 88.3672
temp: 298.150 k
press: 1.00000 atm
elementType: 17 8 8 7 6 6 6 6 6 6 6 6 6 6 6 6 6 6 6 6 1 1 1 1 1 1 1 1 1 1 1 1 1 1 1 1
symmnumber: 1
zpe: 738328.8 jmol-1
zpe.correction: 0.281215 hartree
zpe.thermalcorrener: 0.300322 hartree
zpe.thermalcorrenthalpy: 0.301266 hartree
zpe.thermalcorrgfe: 0.231605 hartree
zpe.sumelectzpe: -1283.132840 hartree
zpe.sumelectthermal: -1283.113732 hartree
zpe.sumelectthermalent: -1283.112788 hartree
zpe.sumelectthermalfe: -1283.182449 hartree
dipole: -0.0565 1.6548 -0.9712
dipole: 1.9196
quadrupole: -136.1370 -118.2196 -128.3512
quadrupole: 10.7526 -7.1615 3.2400
quadrupole: -8.5678 9.3497 -0.7819 10.7526 -7.1615 3.2400
hfenergy: -1283.4140545 hartree
pointgroup: C01 [X(C16H16Cl1N1O2)]
dipole: -0.086449 0.4329792 -0.6126981 debye
polarizability: 292.4728299|-0.9966065|111.8497449|-12.684144|-9.8608636|190.415221 unknown
InChI: InChI=1S/C16H16ClNO2/c1-11-4-3-5-12(2)16(11)18-15(19)10-20-14-8-6-13(17)7-9-14/h3-9,18H,10H2,1-2H3
charge 0 multiplicity 1
36 atoms
Cl 6.979224 0.725525 -1.651031
O  1.190057 -0.075729 -0.164724
O  -1.253998 -1.430449 2.159351
N  -1.401514 -0.106081 0.208423
C  -2.827306 -0.02317 0.030347
C  -3.350708 -0.39948 -1.243303
C  -3.670107 0.465348 1.070267
C  -4.744708 -0.301665 -1.457308
C  -5.063645 0.531693 0.815589
C  -5.602099 0.151758 -0.430944
C  -2.433496 -0.908389 -2.341978
C  -3.118885 0.937382 2.399555
C  -0.730585 -0.790818 1.200765
C  0.802333 -0.738342 1.089386
C  2.562342 0.073916 -0.442036
C  3.596143 -0.382377 0.410919
C  2.871575 0.725752 -1.660504
C  4.945594 -0.181104 0.038628
C  4.215614 0.925299 -2.030928
C  5.238331 0.468051 -1.173364
H  -0.797277 0.260247 -0.536556
H  -5.157808 -0.594632 -2.429483
H  -5.725873 0.90116 1.607081
H  -6.681756 0.215659 -0.605426
H  -1.761561 -0.115134 -2.727911
H  -1.788762 -1.731794 -1.982874
H  -3.019969 -1.28078 -3.198311
H  -2.805615 0.078297 3.020187
H  -2.223122 1.571749 2.261073
H  -3.874592 1.521474 2.951485
H  1.200599 -0.183438 1.96187
H  1.182994 -1.77707 1.119095
H  3.377785 -0.890086 1.354381
H  2.057455 1.070141 -2.304956
H  5.752455 -0.529181 0.689847
H  4.462581 1.427669 -2.970414
