program: Gaussian 09
title: 000295190
version: EM64L-G09RevD.01
frameworkgroup: C1[X(C9H11ClN2O)]
method: RPBEPBE
basis: SDD
operation: Freq
keyword: #p
keyword: freq=noraman
keyword: PBEPBE/SDD
title: #p freq=noraman PBEPBE/SDD
converged: YES YES NO NO
title: Mulliken charges:
elementType: Cl O N N C C C C C C C C C H H H H H H H H H H H
charge: -0.076140 -0.298863 -0.494959 -0.425545 0.313308 0.301838 -0.322112 -0.371553 -0.846581 -0.232582 -0.108994 0.304804 -0.602745 0.313112 0.254524 0.309277 0.251045 0.228059 0.227924 0.253232 0.290406 0.282710 0.224853 0.224982
chargesum: 0.00000
title: Mulliken charges with hydrogens summed into heavy atoms:
elementType: Cl O N N C C C C C C C C C
charge: -0.076140 -0.298863 -0.185682 -0.135139 0.313308 0.301838 -0.009000 -0.117030 -0.139553 0.020650 -0.108994 0.304804 0.129800
polarizability: 2.07156447e+02 -6.95500704e+00 1.25111884e+02 -2.11656540e-03 -1.01749582e-02 5.90722813e+01
1716.lowfreq: -6.8465 -2.6011 -0.0022 -0.0022 -0.0017 11.3568 39.4064 50.6788 105.8025
frequency: 39.3760 50.6666 105.7984 107.7162 121.5296 148.9183 180.5833 209.6449 219.2030 254.7945 269.6901 327.7595 352.9186 383.8015 412.6760 444.4753 472.6101 527.6769 542.3293 578.7629 649.9613 704.8478 713.4989 716.8512 800.4335 840.7481 857.9432 868.4482 938.3690 976.2003 986.0069 1040.4032 1087.2612 1096.7186 1126.6552 1127.7950 1134.1984 1191.8872 1221.7838 1265.3195 1295.1535 1368.6102 1395.3863 1402.0467 1423.9162 1449.3000 1460.0031 1480.9188 1486.2906 1488.1973 1508.1835 1520.0895 1588.7648 1612.3601 1651.3352 2952.1669 2975.7613 3020.2377 3053.1395 3090.3759 3110.0655 3153.7761 3165.9216 3191.2675 3541.0393 3558.8761
redmass: 4.0461 4.3782 1.2781 5.1137 3.1527 2.4610 2.0787 1.3542 5.2619 5.4047 4.9098 2.4151 5.5998 1.8273 5.1675 3.0511 4.1298 5.4018 2.5035 1.3652 6.7174 10.5657 4.6272 4.1562 4.9894 1.3638 6.0818 1.3386 4.1240 1.3074 1.5481 1.5066 2.1816 3.3363 1.9925 1.2755 1.5690 1.7488 2.1861 1.4532 2.3393 5.6342 1.2779 3.8864 1.1671 1.7030 1.3286 1.0446 1.5084 1.0446 1.7127 1.6169 6.1214 6.3488 4.1878 1.0401 1.0354 1.0979 1.1029 1.0944 1.0974 1.0926 1.0908 1.0955 1.0756 1.0770
irintensity: 7.2388 3.8833 0.2667 2.0365 1.7608 2.2622 2.5543 0.3560 0.9735 0.4500 0.7967 1.1124 39.9366 16.6516 4.1740 12.6679 2.6887 0.2826 74.6650 128.2328 17.4429 10.0026 1.0507 5.1931 1.4919 49.8798 33.8021 17.6156 22.0882 3.3460 6.5841 7.0771 10.7703 10.9051 2.9746 0.0664 55.9202 60.0979 249.4538 6.5205 55.3472 93.8107 20.8831 49.5910 34.0387 39.5246 227.2765 14.9157 165.4027 16.0554 127.0193 493.0765 39.7620 0.6083 137.3972 35.0424 105.8222 23.6681 42.4335 15.5073 1.3684 4.0893 2.3388 10.9302 12.8692 22.6222
temp: 298.150 k
press: 1.00000 atm
elementType: 17 8 7 7 6 6 6 6 6 6 6 6 6 1 1 1 1 1 1 1 1 1 1 1
symmnumber: 1
zpe: 490704.8 jmol-1
zpe.correction: 0.186900 hartree
zpe.thermalcorrener: 0.200403 hartree
zpe.thermalcorrenthalpy: 0.201347 hartree
zpe.thermalcorrgfe: 0.145961 hartree
zpe.sumelectzpe: -993.407857 hartree
zpe.sumelectthermal: -993.394354 hartree
zpe.sumelectthermalent: -993.393410 hartree
zpe.sumelectthermalfe: -993.448795 hartree
dipole: -4.3185 4.9896 0.0006
dipole: 6.5990
quadrupole: -78.1428 -77.0611 -87.5963
quadrupole: -7.9460 -0.0026 0.0037
quadrupole: 2.7906 3.8723 -6.6629 -7.9460 -0.0026 0.0037
hfenergy: -993.5947568 hartree
pointgroup: C01 [X(C9H11Cl1N2O1)]
dipole: -1.5841925 -2.0561818 -0.0536259 debye
dipolederiv: -0.9220639 -0.1904666 -0.0085228 -0.1818754 -0.1850154 -0.0032397 -0.0083648 -0.0032712 -0.08085 -0.8424661 -0.0018905 -0.0025898 0.1468573 -0.9664031 -0.0117364 0.000785 -0.0123651 -0.3760589 -2.2145298 0.1242162 -0.0071356 0.5203322 -0.3767734 0.0018165 0.0010009 -0.0002947 -0.3408168 -1.5974508 -0.1860225 -0.0100019 -0.3877177 -0.381841 0.0024922 -0.0109746 0.0038148 -0.5475068 1.469037 0.1424145 0.0101214 0.4402863 -0.0891352 -0.0012898 0.016382 -0.0028219 0.0742144 -0.2273614 -0.0001243 -0.0007498 0.1630593 0.2297668 0.0076741 0.0028202 0.0067812 -0.0754071 -0.235502 0.0325833 0.0003426 -0.2182699 -0.0273861 0.001703 -0.0049964 0.0028489 -0.1568712 -0.1885475 -0.0718876 -0.0019766 -0.0916547 -0.0441356 0.0013097 -0.0024729 0.0013973 -0.1268591 -0.0169066 -0.0394396 -0.0014104 -0.0459664 -0.0673129 -0.0039859 -0.0014973 -0.0038322 0.0947615 -0.1922193 -0.0852054 -0.0023333 -0.0053701 0.0337451 0.0032919 -0.0005609 0.0029211 -0.1169724 1.1436426 0.2869252 0.0125905 0.25423 0.0997524 0.0051738 0.0120442 0.0053618 -0.0758613 2.7548917 0.0626071 0.0141226 -0.3601047 1.3043125 0.0191222 0.0048351 0.0213623 0.3049103 0.6058877 -0.0548522 0.0018549 -0.3600754 0.0147332 -0.0088614 -0.006136 -0.0074387 0.285415 0.1825041 0.0516192 0.0011974 0.0286168 0.077318 -0.0020822 0.0007695 -0.0018713 0.1783949 0.0278187 0.0718234 0.0009315 0.0887528 0.0011613 -0.0030619 0.0013672 -0.003176 0.158347 0.1424502 -0.0488056 -0.0018683 -0.0470192 0.1092214 -0.0039434 -0.0017708 -0.0038625 0.2868396 -0.0595584 0.1677899 0.0032165 0.0486347 0.0276371 -0.0018955 0.0004361 -0.0014252 0.1166395 0.0249597 -0.1026613 0.117603 -0.048677 0.0080399 0.0129754 0.1061785 0.0644081 -0.0438063 0.0264978 -0.0966452 -0.1216456 -0.0436652 0.0117171 -0.010522 -0.1077253 -0.0624962 -0.0489549 0.0776017 -0.0446254 -0.0014152 -0.0520168 -0.0338415 -0.0045953 -0.0016075 -0.0045657 0.1627016 0.1171822 0.0536886 -0.0001504 0.0938622 0.0566688 -0.0062852 0.0001123 -0.0070052 0.3604366 0.1944773 -0.0662171 -0.0017496 0.0579374 -0.0063429 -0.0036229 0.0010491 -0.0041736 0.134865 -0.1367166 -0.0050651 0.0876509 -0.0055606 0.0990967 0.0763807 0.1698638 0.0562028 -0.0783262 -0.1336284 0.000241 -0.0880823 0.0054041 0.1050169 -0.0668178 -0.1715374 -0.0464986 -0.0892343 unknown
polarizability: 206.0924087|11.5656358|126.1373636|1.0195057|1.5235435|59.1108395 unknown
InChI: InChI=1S/C9H11ClN2O/c1-6-5-7(10)3-4-8(6)12-9(13)11-2/h3-5,11-12H,1-2H3
charge 0 multiplicity 1
24 atoms
Cl 4.646645 0.918649 0.052089
O  -2.333339 1.508089 0.028285
N  -1.224084 -0.584765 -0.010195
N  -3.563445 -0.47808 -0.019828
C  0.140673 -0.187895 0.005242
C  1.128152 -1.226066 -0.012992
C  0.539699 1.174828 0.037109
C  2.495206 -0.866686 0.001751
C  0.730116 -2.692745 -0.048122
C  1.90856 1.514508 0.0513
C  2.868964 0.489235 0.033525
C  -2.365952 0.241248 0.001356
C  -4.858448 0.208842 -0.013726
H  -0.226738 1.951531 0.050076
H  3.261924 -1.647542 -0.011824
H  -1.381614 -1.593151 -0.032287
H  1.622386 -3.339347 -0.06004
H  0.133458 -2.984985 0.840261
H  0.13969 -2.943461 -0.953189
H  2.213586 2.56446 0.075923
H  -3.556663 -1.498127 -0.042815
H  -4.655343 1.291206 0.016138
H  -5.457629 -0.064505 0.874889
H  -5.441904 -0.017442 -0.925825
