program: Gaussian 09
title: 000295188
version: EM64L-G09RevD.01
frameworkgroup: C1[X(C14H12Cl2N2O)]
method: RPBEPBE
basis: SDD
operation: Freq
keyword: #p
keyword: freq=noraman
keyword: PBEPBE/SDD
title: #p freq=noraman PBEPBE/SDD
converged: NO YES NO NO
title: Mulliken charges:
elementType: Cl Cl O N N C C C C C C C C C C C C C C H H H H H H H H H H H H
charge: -0.064799 -0.082317 -0.281449 -0.512246 -0.495687 0.336351 0.267945 -0.266779 -0.373496 -0.847319 0.593889 -0.110912 0.271728 -0.269254 -0.358982 -0.309820 -0.221352 -0.222426 -0.244161 0.322781 0.330798 0.233958 0.229984 0.251432 0.230030 0.256622 0.295019 0.314956 0.255208 0.233656 0.236639
chargesum: 0.00000
title: Mulliken charges with hydrogens summed into heavy atoms:
elementType: Cl Cl O N N C C C C C C C C C C C C C C
charge: -0.064799 -0.082317 -0.281449 -0.189465 -0.200668 0.336351 0.267945 0.064019 -0.139538 -0.135872 0.593889 -0.110912 0.271728 -0.012631 -0.358982 0.005137 0.033856 0.011230 -0.007522
polarizability: 3.08404736e+02 -9.12925035e+00 2.24604706e+02 -1.21969139e-02 2.58534573e-02 7.49748045e+01
1716.lowfreq: -5.9993 -3.2476 -0.0010 0.0006 0.0007 1.3568 11.9548 33.4442 54.8851
frequency: 11.7778 33.4318 54.8848 75.2457 84.4035 110.9057 117.7204 153.5892 184.0877 189.4199 217.8531 226.8021 263.8351 298.0109 310.7644 315.7282 358.3760 368.4840 417.3242 430.3390 443.9932 448.1192 482.0648 526.0944 544.5053 586.6937 615.8504 630.9832 657.2407 669.6326 703.7002 715.8352 719.2426 747.8885 758.7501 790.3767 803.9673 833.0082 871.1229 904.5410 916.3511 937.7738 947.2232 982.5130 994.6085 997.0545 1010.6203 1041.3250 1042.5466 1079.5458 1126.1223 1132.4107 1171.7384 1185.3767 1190.3810 1243.4859 1266.7851 1273.8068 1310.9800 1367.1481 1375.1177 1395.0760 1413.8524 1429.1299 1456.4040 1461.3946 1480.7321 1481.8842 1513.1872 1525.1296 1579.1961 1591.9545 1613.4331 1615.2562 1656.1070 2950.6696 3018.7551 3089.0408 3135.2880 3143.3082 3159.7187 3177.2621 3177.9575 3195.0665 3198.9075 3472.5950 3537.5514
redmass: 8.1168 6.0900 7.7911 5.7091 4.7682 4.2892 17.0357 4.9472 1.0917 4.8345 3.4160 9.7358 4.0957 4.9448 8.7319 3.7029 10.0447 9.0461 7.1448 2.7746 2.8709 3.8216 1.6630 6.8360 3.1169 4.3587 6.3399 6.8522 1.2455 7.1661 8.8262 3.8318 3.7208 6.1587 1.2404 5.8128 1.2895 5.9023 1.3451 5.7000 1.3688 1.3435 1.3561 1.5350 1.3119 7.1291 6.6051 1.9575 1.5122 2.1176 1.6211 1.5614 1.0660 2.3884 2.3172 1.6188 1.5728 1.9712 1.9899 5.0580 6.6600 1.3093 3.5301 2.6722 1.9207 2.3985 1.0442 1.4540 1.9931 2.4641 4.8407 5.7058 6.3703 6.4200 3.4241 1.0404 1.0980 1.0942 1.0899 1.0866 1.0919 1.0984 1.0958 1.0952 1.0931 1.0761 1.0756
irintensity: 0.6326 1.0411 0.4767 8.2994 1.0194 0.0146 2.9189 0.1260 0.6815 1.4523 0.7912 1.7306 3.4322 0.6503 10.8720 2.5571 3.1525 11.0725 2.0505 1.5552 22.9824 0.5421 0.3077 20.6567 8.7574 6.4248 8.5687 4.9666 101.7961 18.3483 32.4239 0.0298 6.0560 2.5595 116.3252 1.1576 43.2548 25.9755 4.5371 41.7294 30.1950 0.9465 6.5676 22.5366 3.0302 40.9705 12.5411 8.9281 6.0623 5.8509 3.8182 3.3964 0.0766 46.9351 274.9491 51.7618 77.8863 66.4799 72.7913 83.4725 198.4093 8.1908 156.9258 89.2137 128.8922 1.7490 15.3524 204.9542 1113.9100 26.1698 38.4806 149.9599 112.0642 44.4136 67.7715 33.5267 22.5167 16.9590 15.9401 3.5635 10.8590 9.4745 2.9210 15.8126 19.0407 60.0029 28.9885
temp: 298.150 k
press: 1.00000 atm
elementType: 17 17 8 7 7 6 6 6 6 6 6 6 6 6 6 6 6 6 6 1 1 1 1 1 1 1 1 1 1 1 1
symmnumber: 1
zpe: 602549.2 jmol-1
zpe.correction: 0.229499 hartree
zpe.thermalcorrener: 0.247081 hartree
zpe.thermalcorrenthalpy: 0.248025 hartree
zpe.thermalcorrgfe: 0.181496 hartree
zpe.sumelectzpe: -1644.225938 hartree
zpe.sumelectthermal: -1644.208356 hartree
zpe.sumelectthermalent: -1644.207412 hartree
zpe.sumelectthermalfe: -1644.273941 hartree
dipole: 2.1042 4.3351 0.0007
dipole: 4.8188
quadrupole: -117.1651 -116.0018 -130.7499
quadrupole: -18.1658 -0.0035 0.0031
quadrupole: 4.1405 5.3038 -9.4443 -18.1658 -0.0035 0.0031
hfenergy: -1644.455437 hartree
pointgroup: C01 [X(C14H12Cl2N2O1)]
dipole: 0.5969075 -1.7994417 -0.0002599 debye
polarizability: 309.3369795|-2.0861699|223.6724628|0.0154839|0.0240295|74.9748045 unknown
InChI: InChI=1S/C14H12Cl2N2O/c1-9-6-7-10(15)8-13(9)18-14(19)17-12-5-3-2-4-11(12)16/h2-8,17-18H,1H3
charge 0 multiplicity 1
31 atoms
Cl -4.699078 2.933899 -0.000028
Cl 3.541444 -2.659447 -0.000491
O  0.114491 1.44499 0.000129
N  -0.88282 -0.696891 -0.000375
N  1.435473 -0.511095 -0.000323
C  -2.266472 -0.37016 -0.000309
C  -3.196173 -1.460661 -0.000379
C  -2.727605 0.97263 -0.000198
C  -4.576368 -1.161458 -0.000366
C  -2.719958 -2.903913 -0.000511
C  2.736535 0.041746 -0.000004
C  -4.112023 1.204184 -0.000182
C  0.212549 0.183959 -0.00024
C  -5.059967 0.166639 -0.000271
C  3.852559 -0.841668 -0.000043
C  3.011939 1.438212 0.000333
C  5.180598 -0.392951 0.000241
C  4.343931 1.899749 0.000623
C  5.432307 0.998469 0.000579
H  -0.681124 -1.698244 -0.000492
H  -2.009239 1.792987 -0.000114
H  -5.296564 -1.987545 -0.000416
H  -2.114092 -3.147548 0.89628
H  -3.578625 -3.594602 -0.000186
H  -2.114716 -3.147557 -0.89772
H  -6.131826 0.379945 -0.000258
H  1.421339 -1.536374 -0.000606
H  2.167602 2.129448 0.000354
H  6.001046 -1.116255 0.000195
H  4.52839 2.979125 0.000876
H  6.46415 1.362687 0.000799
