program: Gaussian 09
title: 000295187
version: EM64L-G09RevD.01
frameworkgroup: C1[X(C14H12Cl2N2O)]
method: RPBEPBE
basis: SDD
operation: Freq
keyword: #p
keyword: freq=noraman
keyword: PBEPBE/SDD
title: #p freq=noraman PBEPBE/SDD
converged: NO YES YES YES
title: Mulliken charges:
elementType: Cl Cl O N N C C C C C C C C C C C C C C H H H H H H H H H H H H
charge: -0.066340 -0.080920 -0.283483 -0.504476 -0.494196 0.505897 0.534296 -0.469719 -0.346339 -0.245779 -0.395898 0.588658 0.273497 -0.798067 -0.355204 -0.310316 -0.221783 -0.221483 -0.244248 0.246581 0.308557 0.235038 0.300205 0.295168 0.244297 0.244297 0.224106 0.313113 0.255454 0.232704 0.236383
chargesum: 0.00000
title: Mulliken charges with hydrogens summed into heavy atoms:
elementType: Cl Cl O N N C C C C C C C C C C C C C C
charge: -0.066340 -0.080920 -0.283483 -0.204271 -0.199028 0.505897 0.534296 -0.223138 -0.037781 -0.245779 -0.160860 0.588658 0.273497 -0.085367 -0.355204 0.002797 0.033671 0.011221 -0.007865
polarizability: 3.40180970e+02 1.25409897e+01 2.03666238e+02 -1.34876074e-03 -1.00826176e-03 7.54433804e+01
1716.lowfreq: -0.0017 0.0010 0.0012 2.9715 7.7273 12.0147 20.8119 31.1554 55.5149
frequency: 20.6262 30.8323 55.5119 68.2850 83.6801 108.6951 141.2038 142.0205 154.9411 165.2781 189.3617 236.9233 264.0545 267.2096 295.7692 325.7548 365.2652 395.2524 418.8053 434.0608 440.4803 451.0196 485.5460 499.3151 546.1663 589.6508 606.5723 655.8446 663.1219 680.4045 699.3079 702.5201 718.3802 755.7589 759.4726 777.9110 836.3109 842.2534 857.9958 871.7610 892.8626 948.2468 980.5523 995.1523 996.8471 999.8297 1015.0443 1027.7083 1043.6406 1046.7723 1128.2173 1156.7027 1171.9720 1188.3779 1216.9877 1244.3968 1261.0742 1290.7923 1314.2651 1350.9586 1371.2260 1401.4888 1406.0192 1430.2084 1460.2790 1462.2384 1467.0778 1492.6016 1510.1577 1524.2076 1578.9635 1584.6673 1615.3756 1626.3181 1654.2923 2984.0033 3062.3664 3094.8440 3135.1169 3138.0957 3143.1099 3159.6618 3177.3885 3194.0812 3201.8621 3472.3608 3526.9620
redmass: 7.3213 5.3493 8.4719 6.2997 5.5924 1.0967 3.0310 9.4034 4.7074 9.0564 4.8060 4.7367 4.0472 7.5547 8.1657 3.3332 9.1955 8.0288 7.1899 3.0516 3.0321 3.9616 1.6440 7.4909 3.0349 3.9944 6.5611 1.2599 7.1966 7.4294 2.9170 7.3803 4.0584 5.0294 1.2373 6.9669 6.1128 1.2829 1.6218 1.3401 5.9004 1.3532 1.3145 1.3079 1.4816 6.8710 6.5380 2.9622 1.9662 1.5078 1.5539 1.2862 1.0647 2.7866 1.7194 1.6742 2.0566 1.7472 2.0697 4.0013 6.0647 1.8189 2.1121 2.6758 2.2106 1.0445 1.2997 2.4088 2.2244 2.5426 4.6796 4.5499 6.9856 6.9355 3.5739 1.0370 1.0974 1.0995 1.0910 1.0924 1.0866 1.0919 1.0984 1.0952 1.0943 1.0762 1.0762
irintensity: 0.0043 0.0930 0.0034 6.1226 6.2137 0.8481 0.8161 9.2574 0.0446 0.1160 2.7117 2.9563 3.5151 0.3648 4.5874 0.3474 8.7016 4.0577 4.3202 3.5239 11.8540 1.9593 6.6964 17.7960 18.3022 2.9778 0.5156 97.7005 11.4829 29.3914 22.6644 19.2829 3.9380 2.5336 115.4970 0.3787 13.5338 4.0350 72.8352 6.8700 6.8820 5.8120 4.8532 3.6423 26.8050 19.7536 57.5372 23.2423 7.7983 8.1287 1.1836 4.5722 0.2741 351.9125 29.4572 32.6124 39.2568 114.8445 47.8351 138.9823 243.9254 33.5332 4.4349 86.0744 73.5885 14.1673 18.0122 146.2495 1162.7200 131.9949 66.8418 106.4994 139.6437 61.9741 83.1007 30.5774 15.4370 15.9800 20.3051 2.0186 4.0810 11.0964 9.4909 14.4693 7.0223 61.7111 15.4326
temp: 298.150 k
press: 1.00000 atm
elementType: 17 17 8 7 7 6 6 6 6 6 6 6 6 6 6 6 6 6 6 1 1 1 1 1 1 1 1 1 1 1 1
symmnumber: 1
zpe: 602611.0 jmol-1
zpe.correction: 0.229522 hartree
zpe.thermalcorrener: 0.247214 hartree
zpe.thermalcorrenthalpy: 0.248158 hartree
zpe.thermalcorrgfe: 0.181654 hartree
zpe.sumelectzpe: -1644.227169 hartree
zpe.sumelectthermal: -1644.209477 hartree
zpe.sumelectthermalent: -1644.208533 hartree
zpe.sumelectthermalfe: -1644.275037 hartree
dipole: -1.3547 0.5123 0.0000
dipole: 1.4484
quadrupole: -112.6057 -120.3929 -130.7583
quadrupole: -4.6088 -0.0005 -0.0008
quadrupole: 8.6466 0.8594 -9.5060 -4.6088 -0.0005 -0.0008
hfenergy: -1644.4566913 hartree
pointgroup: C01 [X(C14H12Cl2N2O1)]
dipole: -0.5333136 -0.2007164 0.0000292 debye
polarizability: 340.1403018|-12.7603446|203.706899|0.0135365|-0.0291718|75.4433874 unknown
InChI: InChI=1S/C14H12Cl2N2O/c1-9-6-7-10(8-12(9)16)17-14(19)18-13-5-3-2-4-11(13)15/h2-8,17-18H,1H3
charge 0 multiplicity 1
31 atoms
Cl 5.568501 -2.123821 0.00056
Cl -3.649486 -2.78724 0.000419
O  -0.496839 1.534369 -0.000265
N  0.633991 -0.536569 0.000254
N  -1.691969 -0.503688 0.000136
C  1.990838 -0.109628 0.000135
C  4.790403 0.576398 -0.000066
C  2.983751 -1.125897 0.000355
C  2.394073 1.251247 -0.000183
C  4.339452 -0.764582 0.000252
C  3.769042 1.561947 -0.000276
C  -3.026401 -0.038407 -0.00011
C  -0.516314 0.269385 0.000121
C  6.258159 0.948174 -0.000175
C  -4.081198 -0.993976 -0.000019
C  -3.394652 1.336717 -0.000444
C  -5.436413 -0.635789 -0.00024
C  -4.754602 1.707717 -0.000669
C  -5.780349 0.735809 -0.000572
H  2.704466 -2.18551 0.000608
H  1.637813 2.03682 -0.000345
H  4.068779 2.61633 -0.000524
H  0.504573 -1.55068 0.000455
H  -1.610512 -1.52582 0.000343
H  6.777239 0.54026 0.886586
H  6.777238 0.539749 -0.886699
H  6.382783 2.043725 -0.00049
H  -2.598661 2.083196 -0.000516
H  -6.206621 -1.412208 -0.000154
H  -5.01154 2.772224 -0.000928
H  -6.834138 1.030651 -0.000749
