program: Gaussian 09
title: 000295189
version: EM64L-G09RevD.01
frameworkgroup: C1[X(C15H15ClN2O)]
method: RPBEPBE
basis: SDD
operation: Freq
keyword: #p
keyword: freq=noraman
keyword: PBEPBE/SDD
title: #p freq=noraman PBEPBE/SDD
converged: NO YES NO NO
title: Mulliken charges:
elementType: Cl O N N C C C C C C C C C C C C C C C H H H H H H H H H H H H H H H
charge: -0.085744 -0.283571 -0.513478 -0.499024 0.091353 0.349007 0.376774 -0.358907 -0.459641 -0.882966 -0.224637 -0.843728 0.266165 0.590495 -0.357481 -0.311193 -0.223348 -0.222605 -0.246098 0.305814 0.229825 0.230351 0.230376 0.272387 0.320857 0.225177 0.229374 0.229365 0.235249 0.294173 0.314498 0.254333 0.231650 0.235199
chargesum: 0.00000
title: Mulliken charges with hydrogens summed into heavy atoms:
elementType: Cl O N N C C C C C C C C C C C C C C C
charge: -0.085744 -0.283571 -0.192621 -0.204851 0.091353 0.349007 0.376774 -0.053093 -0.229817 -0.149852 0.000541 -0.149740 0.266165 0.590495 -0.357481 0.003305 0.030984 0.009045 -0.010900
polarizability: 3.22636743e+02 -9.40409009e+00 2.09527875e+02 4.80721337e-03 -4.60344741e-03 8.18196592e+01
1716.lowfreq: -0.0028 -0.0024 -0.0023 3.7963 10.2022 12.5062 21.0401 34.8034 62.3424
frequency: 20.6219 34.4966 62.3421 67.7574 82.2433 128.9871 152.7107 154.0148 168.0853 185.5148 190.8510 228.3081 263.3061 279.2463 292.8123 313.8554 341.6295 367.3234 418.2568 433.2612 460.5443 472.3986 498.3401 501.4542 528.0199 543.9329 579.8966 595.3719 656.1976 656.8777 702.7155 706.3135 717.4996 731.1206 758.1911 780.3341 799.3882 804.4999 845.4546 871.0406 896.5105 916.3405 946.6733 990.8832 991.3145 992.7018 995.3422 1005.7876 1026.2289 1040.0496 1049.9819 1080.8544 1100.3711 1127.9901 1171.1386 1179.8514 1192.9651 1200.7936 1244.7493 1264.4416 1291.7880 1315.2673 1366.0842 1372.8384 1393.4975 1401.6256 1427.3234 1434.0549 1457.5591 1463.2168 1470.0210 1470.6249 1492.6170 1501.0218 1518.6948 1536.7581 1578.6267 1604.0236 1612.8038 1615.9983 1658.0183 2949.0959 2973.9101 3013.1595 3048.8761 3086.2320 3109.9567 3126.6321 3142.4391 3151.4110 3159.4673 3177.5219 3192.6477 3199.7951 3475.5428 3538.2025
redmass: 4.7539 5.1087 6.0107 5.4324 4.9332 2.0781 7.6669 4.3446 1.3171 5.5334 1.1017 2.6569 4.0999 7.9815 2.8927 6.2917 2.7322 9.1192 7.1009 2.9857 3.4227 1.5942 5.1828 3.0966 5.9916 3.2017 3.3344 5.8208 1.2408 6.5952 9.2064 6.1444 4.1257 2.5495 1.2365 6.6538 1.4220 4.8304 4.2390 1.3389 3.1613 1.3400 1.3527 1.4732 1.3169 3.7922 1.3060 5.3095 1.4371 1.9633 1.6160 2.2901 1.9954 1.5464 1.0684 1.5701 2.1280 2.3456 1.5890 1.7723 2.4246 2.1665 4.9052 6.5045 1.2892 1.2197 2.6337 2.4187 2.3004 2.0799 1.3542 1.0462 1.2468 1.0445 2.1734 2.0145 4.9156 6.4761 5.7370 6.7725 3.2959 1.0423 1.0381 1.0978 1.0977 1.0974 1.0912 1.0872 1.0866 1.0960 1.0918 1.0982 1.0953 1.0946 1.0760 1.0754
irintensity: 0.6633 0.2853 0.4290 6.0019 3.3920 0.0829 6.6584 0.1125 0.1944 0.6393 2.4730 0.6298 3.5740 0.8118 9.6032 7.5809 0.0131 10.4053 1.8632 7.4113 0.4925 4.8819 2.3222 0.0022 11.8567 11.3236 0.2995 1.2386 106.8268 15.5382 28.7137 8.2942 3.7344 3.6797 112.4536 2.7717 66.8618 0.2135 0.6580 5.1707 0.4177 4.8369 5.9282 18.0737 1.8197 7.0949 4.2379 36.3031 9.5826 15.1732 1.6666 4.3007 10.1422 0.7666 1.8291 73.3418 3.1814 279.5196 29.6439 5.4868 225.2161 16.0179 37.0050 292.6478 4.9161 17.5297 49.4883 77.1623 133.2427 17.3069 165.9602 23.4660 268.7681 1.6373 743.2140 149.1161 17.5183 115.2907 27.5262 107.1226 81.7687 32.5181 38.6066 22.4280 22.1910 23.3014 14.7774 9.8556 4.3961 29.3186 11.7883 9.1728 16.3587 8.9890 51.8543 33.6600
temp: 298.150 k
press: 1.00000 atm
elementType: 17 8 7 7 6 6 6 6 6 6 6 6 6 6 6 6 6 6 6 1 1 1 1 1 1 1 1 1 1 1 1 1 1 1
symmnumber: 1
zpe: 700638.1 jmol-1
zpe.correction: 0.266859 hartree
zpe.thermalcorrener: 0.284668 hartree
zpe.thermalcorrenthalpy: 0.285612 hartree
zpe.thermalcorrgfe: 0.219752 hartree
zpe.sumelectzpe: -1224.062196 hartree
zpe.sumelectthermal: -1224.044387 hartree
zpe.sumelectthermalent: -1224.043443 hartree
zpe.sumelectthermalfe: -1224.109303 hartree
dipole: -0.4111 2.8523 0.0000
dipole: 2.8818
quadrupole: -99.2072 -114.1313 -125.4324
quadrupole: -8.7043 0.0015 -0.0022
quadrupole: 13.7164 -1.2077 -12.5088 -8.7043 0.0015 -0.0022
hfenergy: -1224.3290548 hartree
pointgroup: C01 [X(C15H15Cl1N2O1)]
dipole: -0.2008019 -1.1158711 -0.0004152 debye
polarizability: 323.1548334|5.4376354|209.0097685|-0.0098891|0.0449199|81.8196754 unknown
InChI: InChI=1S/C15H15ClN2O/c1-10-6-5-9-13(11(10)2)17-15(19)18-14-8-4-3-7-12(14)16/h3-9,17-18H,1-2H3
charge 0 multiplicity 1
34 atoms
Cl 3.273442 -2.801621 -0.000725
O  0.389504 1.704115 0.001463
N  -0.871517 -0.296845 0.001019
N  1.450491 -0.404524 0.000851
C  -3.257618 -0.789819 0.000187
C  -2.212727 0.190844 0.000834
C  -4.613178 -0.355099 0.00004
C  -2.512495 1.577287 0.001276
C  -4.900293 1.033681 0.000495
C  -2.900837 -2.270684 -0.000332
C  -3.859691 1.984941 0.001094
C  -5.768295 -1.346372 -0.000629
C  0.320808 0.440736 0.001482
C  2.809055 -0.020549 0.000502
C  3.807971 -1.034774 -0.000242
C  3.259092 1.330624 0.000846
C  5.181876 -0.757252 -0.000638
C  4.638226 1.621278 0.000453
C  5.60599 0.591687 -0.000287
H  -1.696903 2.301117 0.001747
H  -5.945228 1.364013 0.000377
H  -2.313497 -2.556601 -0.897503
H  -2.314376 -2.557441 0.897146
H  -3.799652 -2.904208 -0.001085
H  -0.788236 -1.314622 0.000704
H  -4.095222 3.054857 0.001433
H  -5.752401 -2.002039 -0.891909
H  -5.752541 -2.003115 0.889854
H  -6.733631 -0.813157 -0.000386
H  1.307101 -1.419638 0.000496
H  2.507901 2.122239 0.001412
H  5.904683 -1.577897 -0.001215
H  4.956562 2.669117 0.000729
H  6.675235 0.824221 -0.000592
