program: Gaussian 09
title: 000295186
version: EM64L-G09RevD.01
frameworkgroup: C1[X(C14H12Cl2N2O)]
method: RPBEPBE
basis: SDD
operation: Freq
keyword: #p
keyword: freq=noraman
keyword: PBEPBE/SDD
title: #p freq=noraman PBEPBE/SDD
converged: NO YES NO NO
title: Mulliken charges:
elementType: Cl Cl O N N C C C C C C C C C C C C C C H H H H H H H H H H H H
charge: -0.067861 -0.082141 -0.282797 -0.495597 -0.497248 0.327441 0.260824 -0.342063 -0.198216 -0.780508 0.591743 -0.221570 -0.266011 0.271257 -0.357962 -0.309517 -0.222050 -0.222138 -0.244566 0.276975 0.311771 0.265194 0.265251 0.193121 0.234243 0.258336 0.295564 0.313840 0.255434 0.232779 0.236470
chargesum: 0.00000
title: Mulliken charges with hydrogens summed into heavy atoms:
elementType: Cl Cl O N N C C C C C C C C C C C C C C
charge: -0.067861 -0.082141 -0.282797 -0.218621 -0.201684 0.327441 0.260824 -0.030291 -0.198216 -0.056942 0.591743 0.012674 -0.007675 0.271257 -0.357962 0.004323 0.033384 0.010641 -0.008095
polarizability: 3.26815305e+02 -1.13366805e+01 2.08558990e+02 1.33327140e-01 -4.27541087e-02 7.50358380e+01
1716.lowfreq: -140.6812 -0.0016 -0.0013 0.0014 3.2431 4.8067 10.4675 17.5185 31.3004
frequency: -140.6789 17.4364 31.2100 56.5128 64.1429 80.6408 122.1315 148.2690 154.5052 172.2985 205.2579 251.8347 263.6352 283.3387 285.1851 332.6162 367.7747 374.3492 423.4388 433.7878 475.1041 478.5745 502.7925 510.6918 543.9155 573.9277 575.1998 644.4721 657.5905 682.6731 702.7452 715.1689 719.2645 759.3170 767.3039 789.1654 789.3068 818.9496 871.6836 885.1374 910.7092 947.9690 986.0655 989.3648 995.4989 1001.6508 1016.6207 1031.5990 1041.9212 1074.4267 1127.0080 1141.4540 1172.0099 1184.4022 1199.3471 1215.5598 1245.1921 1293.3565 1315.1617 1357.7723 1371.6240 1408.2825 1424.1440 1429.7214 1451.9683 1455.6726 1461.4342 1477.0685 1510.8768 1523.4183 1579.3351 1586.3334 1611.2568 1615.4231 1657.6024 2989.9190 3072.7307 3077.7997 3143.4314 3149.3630 3160.2660 3178.0840 3180.7173 3193.4204 3200.8721 3473.3789 3543.2380
redmass: 1.0433 5.8903 6.1829 8.7563 7.0794 5.4009 3.6143 9.6425 4.7555 8.6479 4.0746 6.4322 4.0827 3.5907 9.1022 5.5892 9.0200 8.0144 7.8151 3.0751 4.0774 1.6543 3.3590 6.1781 3.3447 6.5479 3.7324 6.9313 1.2738 7.3701 8.2855 3.0714 3.4867 1.2381 6.1141 1.5541 4.4966 5.3933 1.3406 5.3395 1.3550 1.3537 2.0155 1.3089 1.3078 4.8780 4.9017 1.4804 1.9881 2.1732 1.5936 1.8210 1.0652 2.4876 1.5658 1.8760 1.5918 2.0990 2.0844 5.8920 6.5347 1.3512 2.3911 2.6707 2.2961 1.0416 2.4841 1.3137 2.0277 2.4678 4.7083 4.4010 7.1546 6.6810 3.3355 1.0373 1.0982 1.0973 1.0867 1.0888 1.0919 1.0982 1.0956 1.0954 1.0951 1.0760 1.0750
irintensity: 1.2202 0.1028 0.0004 0.0395 7.1172 3.4404 0.1974 9.5255 0.1601 0.3463 0.3406 0.3571 3.4103 9.4564 2.6609 1.9195 5.3629 16.7942 1.0625 8.4806 1.9942 2.9391 0.0296 4.8076 9.6710 12.3393 1.6148 9.6429 102.3748 32.3413 35.7990 3.6182 1.1989 112.4562 0.2804 69.8259 10.3716 16.7890 5.0267 4.1500 3.8926 5.8366 29.9650 3.1519 3.8997 26.0152 67.2293 7.2116 2.9340 10.3089 1.9661 9.9703 0.4194 308.2735 22.9855 41.6340 33.1195 214.1336 15.9861 46.8830 228.1771 39.0907 231.8681 151.0674 13.9913 13.5491 27.8948 115.1686 860.5761 206.6777 65.8932 228.6155 45.1863 94.7149 74.0464 25.6394 8.8328 44.3438 4.0917 9.2573 11.3053 8.7365 3.1163 15.5553 13.6996 58.7336 37.3422
temp: 298.150 k
press: 1.00000 atm
elementType: 17 17 8 7 7 6 6 6 6 6 6 6 6 6 6 6 6 6 6 1 1 1 1 1 1 1 1 1 1 1 1
symmnumber: 1
zpe: 602354.6 jmol-1
zpe.correction: 0.229425 hartree
zpe.thermalcorrener: 0.246342 hartree
zpe.thermalcorrenthalpy: 0.247286 hartree
zpe.thermalcorrgfe: 0.182325 hartree
zpe.sumelectzpe: -1644.223328 hartree
zpe.sumelectthermal: -1644.206411 hartree
zpe.sumelectthermalent: -1644.205467 hartree
zpe.sumelectthermalfe: -1644.270427 hartree
dipole: 1.7885 1.4208 0.0005
dipole: 2.2841
quadrupole: -119.5482 -118.8472 -130.7192
quadrupole: 0.4216 0.0721 -0.0229
quadrupole: 3.4900 4.1910 -7.6810 0.4216 0.0721 -0.0229
hfenergy: -1644.4527526 hartree
pointgroup: C01 [X(C14H12Cl2N2O1)]
dipole: -0.7109378 0.5482438 -0.0395312 debye
polarizability: 326.420881|13.1034258|208.5665036|3.5787385|-6.494976|75.4227484 unknown
InChI: InChI=1S/C14H12Cl2N2O/c1-9-10(15)6-4-8-12(9)17-14(19)18-13-7-3-2-5-11(13)16/h2-8,17-18H,1H3
charge 0 multiplicity 1
31 atoms
Cl 5.950422 1.522566 -0.009843
Cl -3.334785 2.768143 -0.21102
O  -0.399899 -1.691034 0.060232
N  0.836323 0.326345 -0.018257
N  -1.486073 0.399325 -0.060205
C  2.180198 -0.141981 0.024802
C  3.234353 0.83359 -0.012167
C  2.480263 -1.529931 0.101905
C  4.555044 0.329394 0.03336
C  3.009204 2.334972 -0.096825
C  -2.840746 -0.003332 -0.067471
C  3.818703 -1.961597 0.143669
C  4.882076 -1.034578 0.110173
C  -0.348976 -0.428468 -0.000056
C  -3.849846 0.998042 -0.13533
C  -3.273657 -1.358369 -0.011565
C  -5.2201 0.702907 -0.148638
C  -4.649118 -1.666282 -0.0244
C  -5.628082 -0.649754 -0.09227
H  0.736601 1.340596 -0.069916
H  1.657114 -2.244463 0.127412
H  3.46679 2.845914 0.769129
H  3.490783 2.749183 -1.00064
H  1.949436 2.641199 -0.128067
H  4.037273 -3.032675 0.203325
H  5.925889 -1.355904 0.14224
H  -1.356694 1.415496 -0.106256
H  -2.514311 -2.140289 0.04059
H  -5.95264 1.513139 -0.202083
H  -4.955326 -2.716736 0.01955
H  -6.694318 -0.895419 -0.101779
