program: Gaussian 09
title: 000295185
version: EM64L-G09RevD.01
frameworkgroup: C1[X(C14H12Cl2N2O)]
method: RPBEPBE
basis: SDD
operation: Freq
keyword: #p
keyword: freq=noraman
keyword: PBEPBE/SDD
title: #p freq=noraman PBEPBE/SDD
converged: NO YES NO NO
title: Mulliken charges:
elementType: Cl Cl O N N C C C C C C C C C C C C C C H H H H H H H H H H H H
charge: -0.069048 -0.082788 -0.283497 -0.507770 -0.496270 0.317349 0.292271 -0.311617 -0.366895 -0.846121 0.593888 -0.233178 0.269296 -0.111248 -0.358426 -0.310417 -0.222195 -0.221449 -0.244402 0.320788 0.311215 0.256832 0.253036 0.231040 0.231024 0.255165 0.294735 0.313436 0.255556 0.233088 0.236604
chargesum: 0.00000
title: Mulliken charges with hydrogens summed into heavy atoms:
elementType: Cl Cl O N N C C C C C C C C C C C C C C
charge: -0.069048 -0.082788 -0.283497 -0.186982 -0.201535 0.317349 0.292271 -0.000402 -0.110063 -0.131022 0.593888 0.021986 0.269296 -0.111248 -0.358426 0.003019 0.033361 0.011638 -0.007798
polarizability: 3.39183617e+02 7.85780326e+00 2.01902534e+02 -7.56827224e-05 -1.29344889e-04 7.48531818e+01
1716.lowfreq: -8.1145 -3.1878 -0.0026 -0.0021 -0.0011 0.8545 14.5858 27.2686 52.5490
frequency: 14.5641 27.2612 52.5485 63.8882 79.2325 130.1068 132.6528 154.6670 179.4858 180.5520 206.3510 223.2149 262.2982 269.8426 310.0349 338.4064 362.2271 391.7933 423.0623 430.8123 441.6955 452.1278 476.0229 522.4639 540.7461 558.0203 574.3883 646.6257 653.4302 672.1397 702.5114 716.4203 719.4918 758.2516 758.8549 785.7827 840.2148 850.6571 869.6221 870.9662 880.2285 947.4145 975.6632 985.6197 994.4854 996.3530 1009.5014 1039.7101 1040.8433 1089.6729 1118.0966 1128.0353 1171.5915 1188.5963 1192.4629 1243.9013 1264.6584 1290.8284 1313.7545 1366.8552 1373.0524 1396.6918 1401.6248 1428.5613 1453.7226 1460.0975 1481.9557 1484.3260 1511.1352 1523.6247 1578.1429 1590.6236 1612.4165 1615.0923 1654.9936 2954.9941 3023.9719 3093.0337 3143.1805 3156.4258 3159.8070 3168.4770 3177.4599 3194.8949 3196.6142 3473.0469 3538.7313
redmass: 5.4247 7.1694 8.1409 6.3150 5.9515 4.0009 12.8134 4.4952 1.9501 6.1382 1.4184 6.0973 4.0024 7.8031 6.3946 3.9864 10.8353 7.2310 8.5106 2.8347 3.0232 4.0083 1.7590 5.3001 3.3022 3.0410 6.8503 7.0452 1.2425 7.1270 9.1815 4.0716 3.9901 6.2538 1.2387 5.9939 1.3655 5.9316 1.3406 1.3430 5.8694 1.3547 1.3131 1.5288 1.3096 7.2533 6.8663 1.9648 1.5113 1.9799 1.9090 1.5492 1.0648 2.8390 1.7476 1.6090 1.4892 1.9997 2.0781 5.2608 6.9156 1.2737 3.8383 2.6496 1.7544 2.4732 1.0442 1.6256 1.8249 2.4151 4.8848 5.9245 6.3498 6.7874 3.4628 1.0403 1.0980 1.0944 1.0867 1.0927 1.0919 1.0912 1.0985 1.0952 1.0951 1.0760 1.0755
irintensity: 0.7585 0.1325 0.2374 5.9782 4.9369 0.1875 4.8648 0.0214 2.0969 2.3583 0.3146 0.6135 2.9108 0.1541 5.5207 1.8617 20.3907 12.2174 6.1515 0.9595 18.6048 2.7976 6.4584 0.2662 20.6694 0.0991 0.2425 7.0202 97.6715 33.3909 25.4037 0.1399 8.5902 2.7569 115.2265 2.6964 49.9499 39.7183 16.6135 6.2973 9.9758 5.7218 3.2268 8.8023 3.2436 20.4015 24.4382 14.4066 7.0023 21.8808 11.3301 1.7545 0.5830 241.3596 79.9689 34.7177 12.5206 178.5936 32.2927 28.3222 322.6399 26.9657 65.6124 89.1079 102.4251 33.5658 15.5457 447.3196 975.7493 68.2770 24.6913 45.4415 0.7538 119.4566 87.4460 28.6210 21.0665 16.7326 3.8716 3.9323 11.0067 1.6615 9.5070 15.8937 9.1225 60.6175 29.1590
temp: 298.150 k
press: 1.00000 atm
elementType: 17 17 8 7 7 6 6 6 6 6 6 6 6 6 6 6 6 6 6 1 1 1 1 1 1 1 1 1 1 1 1
symmnumber: 1
zpe: 602489.7 jmol-1
zpe.correction: 0.229476 hartree
zpe.thermalcorrener: 0.247097 hartree
zpe.thermalcorrenthalpy: 0.248041 hartree
zpe.thermalcorrgfe: 0.181406 hartree
zpe.sumelectzpe: -1644.225956 hartree
zpe.sumelectthermal: -1644.208335 hartree
zpe.sumelectthermalent: -1644.207391 hartree
zpe.sumelectthermalfe: -1644.274026 hartree
dipole: -2.9239 2.9489 0.0000
dipole: 4.1528
quadrupole: -129.4434 -114.5862 -130.7284
quadrupole: 10.4136 0.0006 0.0003
quadrupole: -4.5240 10.3331 -5.8091 10.4136 0.0006 0.0003
hfenergy: -1644.4554321 hartree
pointgroup: C01 [X(C14H12Cl2N2O1)]
dipole: -1.0741815 1.2310605 -0.0002339 debye
polarizability: 339.6257132|-0.92634|201.4604307|-0.006905|-0.0279983|74.8531881 unknown
InChI: InChI=1S/C14H12Cl2N2O/c1-9-8-10(15)6-7-12(9)17-14(19)18-13-5-3-2-4-11(13)16/h2-8,17-18H,1H3
charge 0 multiplicity 1
31 atoms
Cl 6.678361 -0.884406 0.000051
Cl -3.547448 2.677908 -0.000424
O  -0.285966 -1.558394 0.000538
N  0.790891 0.543961 0.000057
N  -1.532922 0.44672 0.000104
C  2.161924 0.161598 0.000077
C  3.13391 1.213922 -0.000198
C  2.577855 -1.195632 0.000345
C  4.5053 0.872231 -0.000202
C  2.716922 2.675771 -0.000503
C  -2.854583 -0.053996 0.000221
C  3.950995 -1.517557 0.000336
C  -0.336114 -0.294331 0.000274
C  4.896764 -0.479069 0.000061
C  -3.933634 0.873724 0.000003
C  -3.188108 -1.438165 0.000539
C  -5.279378 0.481928 0.000086
C  -4.538174 -1.843482 0.000627
C  -5.588356 -0.898084 0.000403
H  0.627159 1.552056 -0.000137
H  1.8244 -1.984492 0.000559
H  5.261712 1.662911 -0.000408
H  3.60081 3.33346 -0.000585
H  2.121192 2.940621 -0.897725
H  2.121104 2.940983 0.896554
H  4.270108 -2.563381 0.000545
H  -1.479807 1.470671 -0.000151
H  -2.373367 -2.163987 0.000706
H  -6.069062 1.238439 -0.000097
H  -4.767852 -2.914182 0.000873
H  -6.634237 -1.219845 0.00047
