program: Gaussian 09
title: 000295182
version: EM64L-G09RevD.01
frameworkgroup: C1[X(C14H11ClN2O4)]
method: RPBEPBE
basis: SDD
operation: Freq
keyword: #p
keyword: freq=noraman
keyword: PBEPBE/SDD
title: #p freq=noraman PBEPBE/SDD
converged: YES YES NO NO
title: Mulliken charges:
elementType: Cl O O O O N N C C C C C C C C C C C C C C H H H H H H H H H H H
charge: -0.059265 -0.329846 -0.250014 -0.217681 -0.207191 -0.442149 0.021978 0.417403 0.200951 -0.476668 0.389139 -0.340978 -0.408354 -0.774008 0.591263 -0.359764 -0.316417 0.246711 -0.213447 -0.220034 -0.238577 0.311364 0.292406 0.268256 0.221687 0.254800 0.254977 0.344693 0.302640 0.259044 0.236899 0.240185
chargesum: 0.00000
title: Mulliken charges with hydrogens summed into heavy atoms:
elementType: Cl O O O O N N C C C C C C C C C C C C C C
charge: -0.059265 -0.329846 -0.250014 -0.217681 -0.207191 -0.097456 0.021978 0.417403 0.200951 -0.165304 0.389139 -0.048572 -0.140098 -0.042545 0.591263 -0.359764 -0.013777 0.246711 0.045598 0.016865 0.001608
polarizability: 3.55803612e+02 9.85461039e+00 2.13737975e+02 -4.80290872e-03 8.28138212e-02 7.53637489e+01
1716.lowfreq: -5.3615 -4.0151 -0.0022 -0.0016 -0.0010 1.5519 12.7010 20.6215 23.1927
frequency: 12.5197 20.5603 23.1587 48.6206 59.7961 79.1820 120.1002 123.4655 162.4332 179.7107 200.4856 235.5182 236.4972 268.6994 279.5087 308.5813 308.7508 361.8130 383.6724 406.2445 423.5164 438.9435 443.2984 506.1922 537.5601 554.8068 561.9374 566.3552 635.4285 665.3108 666.5913 673.5633 693.7017 709.8566 727.7123 738.9498 748.8433 763.6841 768.7010 842.9867 847.1598 871.2010 906.6738 910.1196 950.7525 973.4102 985.9346 992.7937 1010.0925 1023.1435 1042.2445 1042.9851 1059.5325 1123.6510 1137.8756 1151.2983 1159.6798 1175.2728 1204.4900 1227.7345 1245.4155 1279.8112 1308.7552 1349.9384 1374.0591 1382.6325 1405.1011 1419.1500 1430.4458 1454.8089 1455.2608 1466.2057 1474.8755 1515.1228 1579.3228 1584.9404 1605.5913 1616.0768 1687.1169 2998.3521 3082.4614 3101.9512 3146.0778 3161.8018 3172.8130 3178.3341 3191.0452 3192.9060 3203.7395 3491.8207
redmass: 6.2037 8.7728 6.7768 8.1293 11.1463 5.5930 6.3565 10.4473 5.4460 7.7480 2.9633 1.1387 9.6551 7.6235 4.8801 7.1182 5.4214 10.0058 5.1787 8.0674 7.8849 3.3410 3.1174 5.5282 3.6108 5.7282 3.9240 7.2436 7.2651 4.6277 3.9433 7.3815 7.6626 3.0022 5.0016 1.5819 7.6179 1.2755 9.5206 1.4273 5.7083 1.3514 6.9999 1.3487 1.3590 3.4993 1.3241 1.3171 4.7549 1.9407 1.9865 1.5426 4.5123 2.0076 1.7804 2.1409 1.6910 1.0705 8.7653 3.4228 1.6383 1.5793 1.7328 6.0263 7.5515 3.2472 1.8971 2.4728 2.4934 2.2162 1.0458 1.9867 1.4324 2.4720 5.6884 7.2511 6.6103 6.3122 9.6623 1.0364 1.0959 1.1017 1.0867 1.0919 1.0894 1.0978 1.0962 1.0966 1.0925 1.0761
irintensity: 0.1099 0.0200 0.1365 0.1958 6.9025 0.0580 2.2797 4.0877 0.6155 2.3698 0.9189 0.3431 1.9798 5.4140 4.9149 0.5365 0.6272 11.1257 0.8927 3.3314 2.2396 8.3624 7.1626 0.0618 4.5250 1.6308 0.0195 5.2636 5.6524 7.4522 3.6871 28.1051 11.2642 25.9437 6.1040 30.8404 7.2646 146.0908 29.0773 39.0478 16.9066 3.4727 60.9545 25.8682 5.5792 297.9046 0.4205 1.6714 46.7937 72.1456 0.2729 12.2403 58.4081 455.7693 251.2613 540.7782 7.3367 1.3772 478.6476 51.9484 26.8390 94.9992 6.1823 97.7226 128.8338 50.6844 32.7835 45.3063 139.2044 36.0520 13.2517 49.0287 150.6254 612.8915 38.6816 15.7750 213.9011 40.3029 250.6485 8.4466 6.4114 21.0799 2.7507 9.5011 0.8111 7.1281 9.4923 4.8479 4.6119 84.7072
temp: 298.150 k
press: 1.00000 atm
elementType: 17 8 8 8 8 7 7 6 6 6 6 6 6 6 6 6 6 6 6 6 6 1 1 1 1 1 1 1 1 1 1 1
symmnumber: 1
zpe: 597171.2 jmol-1
zpe.correction: 0.227451 hartree
zpe.thermalcorrener: 0.246188 hartree
zpe.thermalcorrenthalpy: 0.247132 hartree
zpe.thermalcorrgfe: 0.176573 hartree
zpe.sumelectzpe: -1408.998837 hartree
zpe.sumelectthermal: -1408.980100 hartree
zpe.sumelectthermalent: -1408.979156 hartree
zpe.sumelectthermalfe: -1409.049715 hartree
dipole: 6.9010 0.5519 0.0087
dipole: 6.9230
quadrupole: -152.5421 -120.7866 -130.7110
quadrupole: 1.2642 -0.1578 -0.0387
quadrupole: -17.8622 13.8933 3.9689 1.2642 -0.1578 -0.0387
hfenergy: -1409.2262876 hartree
pointgroup: C01 [X(C14H11Cl1N2O4)]
dipole: 2.7121895 -0.24821 0.0333762 debye
polarizability: 354.9441361|-18.6489015|130.090422|-4.7095196|-66.8828159|159.8707786 unknown
InChI: InChI=1S/C14H11ClN2O4/c1-9-8-10(6-7-13(9)17(19)20)21-14(18)16-12-5-3-2-4-11(12)15/h2-8,16H,1H3
charge 0 multiplicity 1
32 atoms
Cl 4.370525 1.444414 -2.22652
O  0.030034 0.547385 -0.669455
O  0.834059 -0.886386 1.064443
O  -6.224417 1.314528 -0.95875
O  -6.253199 -0.114841 0.808504
N  2.235517 0.229167 -0.48572
N  -5.621466 0.562828 -0.093962
C  -3.381144 -0.308091 0.758304
C  -4.142932 0.484876 -0.152917
C  -1.970187 -0.299268 0.599045
C  -1.359792 0.464616 -0.420377
C  -3.523893 1.249987 -1.174616
C  -2.13255 1.244207 -1.314391
C  -3.955778 -1.153746 1.877835
C  3.531227 -0.182834 -0.089896
C  4.652484 0.304923 -0.814644
C  3.777655 -1.062508 0.999101
C  1.034961 -0.130816 0.088896
C  5.970345 -0.05061 -0.491207
C  5.099125 -1.424791 1.330877
C  6.197886 -0.926661 0.595195
H  -1.353103 -0.890991 1.275521
H  -4.158292 1.837871 -1.841808
H  -1.632828 1.825535 -2.093364
H  -3.141611 -1.654274 2.427397
H  -4.546611 -0.545285 2.58379
H  -4.653294 -1.917326 1.492686
H  2.179479 0.867081 -1.286876
H  2.928277 -1.447284 1.567016
H  6.802101 0.350188 -1.077275
H  5.267553 -2.103402 2.173313
H  7.221769 -1.210788 0.856453
