program: Gaussian 09
title: 000295176
version: EM64L-G09RevD.01
frameworkgroup: C1[X(C11H16N2O)]
method: RPBEPBE
basis: SDD
operation: Freq
keyword: #p
keyword: freq=noraman
keyword: PBEPBE/SDD
title: #p freq=noraman PBEPBE/SDD
converged: NO YES NO NO
title: Mulliken charges:
elementType: O N N C C C C C C C C C C C H H H H H H H H H H H H H H H H
charge: -0.294123 -0.509600 -0.415794 0.287844 0.295520 0.467188 -0.567455 -0.336765 -0.411058 -0.856736 -0.816592 0.303687 -0.336376 -0.632361 0.228527 0.305353 0.227286 0.303822 0.223459 0.223712 0.246936 0.219992 0.223657 0.231487 0.211379 0.211378 0.280004 0.243529 0.243418 0.198680
chargesum: 0.00000
title: Mulliken charges with hydrogens summed into heavy atoms:
elementType: O N N C C C C C C C C C C C
charge: -0.294123 -0.205777 -0.135789 0.287844 0.295520 0.467188 -0.338928 -0.031411 -0.183772 -0.162630 -0.141455 0.303687 0.086381 0.053266
polarizability: 2.12812570e+02 8.74511964e+00 1.43487122e+02 -5.67340408e-01 -1.80173561e-02 7.52446841e+01
1716.lowfreq: -112.0355 -28.6086 0.0005 0.0006 0.0006 5.0367 7.9947 16.5738 19.2286
frequency: -112.0332 -28.5477 19.2155 44.2733 72.4298 98.2772 136.8971 187.5879 212.5140 218.1636 249.7710 273.5020 296.1833 322.8820 330.8961 390.5643 402.9931 443.4906 455.9089 528.9913 554.5709 559.1772 589.2579 695.2411 710.7682 730.4413 751.4379 789.7325 799.4178 845.5873 882.9638 890.1285 923.4968 974.8369 976.1602 982.6752 1013.1637 1041.4256 1046.7197 1088.4094 1111.5362 1138.9907 1142.2583 1170.7309 1225.6992 1244.3893 1290.0218 1290.9765 1299.6946 1344.9761 1365.8818 1392.8763 1395.9661 1404.6049 1415.3650 1453.0160 1461.9720 1472.3346 1472.6573 1474.3243 1481.7346 1487.3565 1500.4952 1516.3286 1531.1234 1596.2534 1630.7508 1658.3855 2946.2365 2948.2753 2969.2245 2986.4214 2999.8032 3012.6048 3048.7887 3078.8827 3084.1721 3099.5601 3108.9423 3124.5896 3133.1198 3192.8994 3524.0788 3542.0663
redmass: 2.0497 1.0171 3.0527 3.8051 4.0135 3.8835 2.9695 1.9160 3.6619 1.3021 3.8290 1.0768 3.3404 5.2832 2.2514 1.8857 4.1108 3.0115 3.0553 5.2023 3.3091 2.9269 1.2921 11.7501 5.4297 3.6697 5.1283 4.2150 1.1162 1.3293 1.2996 4.5608 3.1166 1.5046 2.7165 1.3145 1.4998 1.5050 1.5462 3.0475 2.2111 2.0702 1.5055 1.5150 1.7348 2.4531 1.5400 1.0938 3.6592 1.3384 5.0453 1.2701 1.2247 1.2095 3.2309 1.6300 1.0406 1.0556 1.0565 1.0999 1.0451 1.1833 1.4000 2.4800 1.4988 5.3192 6.1560 4.1392 1.0401 1.0574 1.0387 1.1051 1.0411 1.0977 1.0949 1.0994 1.0941 1.0944 1.0910 1.0909 1.1013 1.0938 1.0761 1.0750
irintensity: 0.5191 0.5193 3.0716 1.6450 7.1863 1.3542 0.6627 4.2806 3.9297 0.9606 2.5090 0.0210 1.3602 10.9909 1.2680 3.6952 3.8183 8.1284 1.0632 1.8334 22.2704 34.1532 136.1881 13.9551 0.3192 2.6204 3.1515 0.7465 1.9492 50.1884 0.5269 2.0233 1.8926 5.3099 0.6260 5.0688 4.5529 2.5418 24.0055 23.7462 3.1381 38.3479 6.0916 11.3878 157.1708 228.6204 7.0779 0.2101 80.4683 191.4450 104.4343 22.5090 9.2487 35.1428 4.1624 150.6750 10.2005 36.4248 14.4810 14.2097 13.7327 51.8690 9.9333 453.6440 164.1305 34.4750 7.8661 141.7908 36.1605 104.6188 53.6812 42.7142 50.0460 27.3876 26.4558 18.5779 16.8015 38.0676 29.0331 19.2998 25.1885 6.8040 12.9155 13.7857
temp: 298.150 k
press: 1.00000 atm
elementType: 8 7 7 6 6 6 6 6 6 6 6 6 6 6 1 1 1 1 1 1 1 1 1 1 1 1 1 1 1 1
symmnumber: 1
zpe: 659743.6 jmol-1
zpe.correction: 0.251283 hartree
zpe.thermalcorrener: 0.265054 hartree
zpe.thermalcorrenthalpy: 0.265998 hartree
zpe.thermalcorrgfe: 0.209635 hartree
zpe.sumelectzpe: -612.462860 hartree
zpe.sumelectthermal: -612.449089 hartree
zpe.sumelectthermalent: -612.448145 hartree
zpe.sumelectthermalfe: -612.504508 hartree
dipole: 1.1364 4.4731 0.0679
dipole: 4.6157
quadrupole: -69.5559 -77.4502 -88.5451
quadrupole: 8.0629 -0.2051 -0.0163
quadrupole: 8.9612 1.0668 -10.0280 8.0629 -0.2051 -0.0163
hfenergy: -612.7141427 hartree
pointgroup: C01 [X(C11H16N2O1)]
dipole: 0.4494805 -1.7592118 -0.0279224 debye
polarizability: 212.8369542|-8.6509976|143.463442|0.4689277|0.0237609|75.2439796 unknown
InChI: InChI=1S/C11H16N2O/c1-4-12-11(14)13-10-6-5-8(2)7-9(10)3/h5-7,12-13H,4H2,1-3H3
charge 0 multiplicity 1
30 atoms
O  2.004484 1.340283 0.00542
N  0.77844 -0.679629 0.002991
N  3.10637 -0.748978 -0.002495
C  -1.608859 -1.181109 0.004927
C  -0.563294 -0.202336 0.005744
C  -3.301772 0.63426 0.012609
C  -2.950693 -0.73907 0.009811
C  -0.893559 1.177872 0.013604
C  -2.24569 1.577289 0.018632
C  -1.292924 -2.669095 0.004135
C  -4.756228 1.073064 -0.014361
C  1.975817 0.074898 0.004017
C  4.536636 -0.356596 -0.007609
C  4.842927 1.152245 -0.004786
H  -3.748271 -1.493783 0.012268
H  -0.086996 1.912544 0.019523
H  -2.479436 2.64914 0.028001
H  0.868044 -1.696461 -0.000705
H  -0.717117 -2.975913 -0.893683
H  -0.713969 -2.97665 0.899663
H  -2.221737 -3.262999 0.005331
H  -5.406802 0.359769 0.523186
H  -4.885716 2.066608 0.450241
H  -5.136631 1.144937 -1.052502
H  5.0188 -0.816006 0.880701
H  5.011196 -0.811135 -0.902505
H  2.954758 -1.759765 -0.004496
H  4.425152 1.657975 -0.888196
H  4.433103 1.653032 0.885134
H  5.943172 1.270908 -0.009395
