program: Gaussian 09
title: 000295197
version: EM64L-G09RevD.01
frameworkgroup: C1[X(C21H18ClNO)]
method: RPBEPBE
basis: SDD
operation: Freq
keyword: #p
keyword: freq=noraman
keyword: PBEPBE/SDD
title: #p freq=noraman PBEPBE/SDD
converged: YES YES NO NO
title: Mulliken charges:
elementType: Cl O N C C C C C C C C C C C C C C C C C C C C C H H H H H H H H H H H H H H H H H H
charge: -0.066254 -0.261193 -0.446615 -0.573663 0.502891 0.504048 0.210706 0.331537 -0.427946 -0.342923 -0.352873 -0.430081 0.261489 -0.226225 -0.237300 -0.236547 -0.225925 -0.353765 -0.243759 -0.243924 -0.200567 -0.781625 -0.223204 -0.261881 0.181467 0.287482 0.218151 0.261360 0.267313 0.217651 0.224943 0.225813 0.225906 0.224890 0.313279 0.228999 0.228837 0.264386 0.264567 0.196847 0.235309 0.258396
chargesum: 0.00000
title: Mulliken charges with hydrogens summed into heavy atoms:
elementType: Cl O N C C C C C C C C C C C C C C C C C C C C C
charge: -0.066254 -0.261193 -0.159133 -0.392196 0.502891 0.504048 0.210706 0.331537 -0.209795 -0.081563 -0.085561 -0.212430 0.261489 -0.001282 -0.011486 -0.010640 -0.001035 -0.040486 -0.014760 -0.015087 -0.200567 -0.055824 0.012106 -0.003485
polarizability: 2.96178295e+02 -2.65976848e-01 2.07109678e+02 8.47025165e+00 -1.80217479e-01 2.40533408e+02
1716.lowfreq: -128.4376 -15.9653 -3.0076 0.0003 0.0005 0.0007 5.3084 6.8447 11.1306
frequency: -128.4360 -15.1852 10.0458 26.0380 39.1300 62.1434 62.8160 68.9061 118.4330 141.2344 151.1768 196.7728 198.5521 218.6914 246.4707 254.3231 271.2851 305.0868 323.0230 344.4939 376.8858 399.3069 406.5017 454.6477 474.4357 490.2556 502.0628 531.7925 538.7380 566.5236 598.0274 614.6420 615.2373 640.1238 659.4404 694.5930 702.2723 708.2546 719.3604 748.5138 754.8205 780.6188 791.7145 803.5134 817.7250 844.3458 853.4077 857.8982 870.5713 914.0078 914.6675 920.3452 955.9891 970.3080 976.6333 989.2217 991.4957 991.6353 993.7472 997.0536 1000.7083 1027.5580 1028.4304 1032.7569 1072.9011 1077.1812 1090.8069 1126.9515 1155.3252 1171.6701 1172.0276 1179.6849 1188.1833 1191.0886 1195.2813 1200.2471 1214.6985 1230.1047 1281.3065 1303.1235 1333.5475 1346.2878 1360.5696 1381.7628 1385.2507 1408.0193 1421.2987 1439.5559 1442.1641 1447.3466 1457.1559 1474.6418 1476.4160 1481.6850 1506.3239 1581.0163 1590.9025 1592.5821 1605.7350 1608.7283 1610.7823 1624.8634 2987.3552 2990.9521 3071.1917 3082.9952 3109.4784 3111.2892 3126.9222 3127.5068 3139.9663 3140.7729 3149.5917 3156.0836 3158.5058 3167.6097 3172.3721 3179.7391 3199.4195 3556.0700
redmass: 1.0372 3.7514 7.2074 4.6275 4.7657 4.7348 5.6443 5.6066 5.3958 4.7056 6.0937 6.1382 4.5966 4.4767 6.4211 4.8225 4.3727 4.2085 7.0396 5.5797 8.1265 2.7903 2.8669 4.6661 3.4276 3.9744 3.3852 4.7225 5.9504 3.7864 4.9800 6.4158 6.4069 1.3396 6.5368 3.0378 2.6208 1.6952 2.6522 2.8716 1.9021 3.7573 1.4737 5.9092 3.5802 1.2655 1.2531 3.9273 4.4231 1.3873 1.4326 1.7717 3.0840 1.4054 1.4059 5.4708 4.5903 1.3166 1.3436 1.3856 1.7835 2.1969 2.3092 1.4829 2.1370 1.6307 1.6094 3.0295 1.6229 1.0833 1.1690 2.0874 1.2307 1.8145 1.1184 1.6708 1.8392 1.6199 2.0512 1.7223 1.2589 1.5198 4.6503 6.8273 6.1355 1.4945 2.0274 2.1204 2.1717 2.2508 1.0421 1.5122 2.2079 2.0075 1.8862 4.7851 5.9563 6.2387 6.0812 7.4318 5.6716 4.2586 1.0839 1.0377 1.0980 1.0973 1.0878 1.0876 1.0864 1.0867 1.0924 1.0928 1.0888 1.0961 1.0975 1.0994 1.0970 1.0956 1.0954 1.0751
irintensity: 1.0783 0.1909 0.1176 0.3666 0.1183 1.0567 2.7873 0.0636 3.5263 0.5902 3.9205 2.9766 2.0440 4.4910 0.4635 0.4077 0.5649 6.4832 4.0605 1.2133 14.1958 0.0418 0.1701 0.8511 3.8026 0.5532 0.0999 13.6067 8.7503 0.1155 67.0860 0.2064 0.3603 56.9504 4.0121 15.5072 17.0771 86.3340 4.0691 23.6322 26.8811 9.3905 69.2319 7.8893 11.4813 0.1649 1.1066 2.6163 14.9205 0.9124 3.5009 0.1508 12.0217 0.0185 2.7377 0.3118 0.6138 3.4201 0.0134 8.1688 43.9265 14.1059 7.9682 6.4131 15.8868 1.0808 21.2339 103.7609 82.3602 0.1222 1.0782 1.3844 0.3787 1.8606 2.6540 6.7093 3.2163 3.5877 28.6057 48.6403 3.8634 5.4759 91.5062 0.0812 3.0425 68.9655 244.1251 0.2905 15.7870 12.6741 12.1275 78.9159 41.5407 10.0855 262.4404 258.0495 0.2456 8.3930 16.5879 22.0085 0.4553 48.4383 28.1647 22.2373 8.2335 42.4197 9.0590 12.0932 0.5688 0.7760 5.6625 53.2659 8.6050 32.3928 21.3920 16.0516 10.3248 3.3597 12.8005 26.8640
temp: 298.150 k
press: 1.00000 atm
elementType: 17 8 7 6 6 6 6 6 6 6 6 6 6 6 6 6 6 6 6 6 6 6 6 6 1 1 1 1 1 1 1 1 1 1 1 1 1 1 1 1 1 1
symmnumber: 1
zpe: 864986.5 jmol-1
zpe.correction: 0.329456 hartree
zpe.thermalcorrener: 0.349075 hartree
zpe.thermalcorrenthalpy: 0.350019 hartree
zpe.thermalcorrgfe: 0.278489 hartree
zpe.sumelectzpe: -1399.417400 hartree
zpe.sumelectthermal: -1399.397781 hartree
zpe.sumelectthermalent: -1399.396837 hartree
zpe.sumelectthermalfe: -1399.468367 hartree
dipole: 0.9821 0.0693 -2.3038
dipole: 2.5054
quadrupole: -153.7852 -143.7858 -132.6493
quadrupole: 0.1899 -3.6774 0.0922
quadrupole: -10.3784 -0.3791 10.7575 0.1899 -3.6774 0.0922
hfenergy: -1399.7468557 hartree
pointgroup: C01 [X(C21H18Cl1N1O1)]
dipole: -0.4293666 0.2783809 0.8424591 debye
polarizability: 293.0960908|-10.0716531|209.8506766|14.0029027|5.3747049|240.8746143 unknown
InChI: InChI=1S/C21H18ClNO/c1-15-18(22)13-8-14-19(15)23-21(24)20(16-9-4-2-5-10-16)17-11-6-3-7-12-17/h2-14,20,23H,1H3
charge 0 multiplicity 1
42 atoms
Cl 6.307551 -0.548218 1.673043
O  0.029697 -0.37126 -1.67368
N  1.250621 -0.082209 0.314753
C  -1.180193 0.311227 0.372074
C  -1.791567 1.629721 -0.141538
C  -2.200103 -0.843648 0.412453
C  0.078057 -0.081983 -0.441677
C  2.584309 -0.390522 -0.085004
C  -2.139585 2.632653 0.798556
C  -2.662248 -1.48541 -0.764829
C  -2.045197 1.863622 -1.517435
C  -2.711985 -1.262212 1.666685
C  3.62311 -0.311959 0.903879
C  -2.733051 3.8447 0.379275
C  -3.61763 -2.522215 -0.682463
C  -2.633632 3.077146 -1.936963
C  -3.671246 -2.296805 1.748912
C  2.879779 -0.766908 -1.423589
C  -2.982714 4.071111 -0.993226
C  -4.128415 -2.931046 0.571639
C  4.92954 -0.628031 0.462928
C  3.393807 0.080851 2.354024
C  4.203455 -1.068849 -1.794748
C  5.252268 -1.003461 -0.852403
H  -0.875701 0.495445 1.420941
H  1.135873 0.177524 1.294432
H  -1.952995 2.463694 1.867072
H  -2.255827 -1.18737 -1.735867
H  -1.759576 1.107155 -2.254569
H  -2.365225 -0.772528 2.585986
H  -2.997015 4.60796 1.120057
H  -3.963362 -3.012536 -1.599559
H  -2.819651 3.24682 -3.003567
H  -4.057714 -2.606275 2.726591
H  2.065457 -0.816165 -2.147131
H  -3.441184 5.010115 -1.323096
H  -4.871127 -3.734564 0.630687
H  3.717702 -0.729253 3.031985
H  3.993886 0.971103 2.614818
H  2.345152 0.312989 2.605088
H  4.421944 -1.358134 -2.827757
H  6.284428 -1.235277 -1.126578
