program: Gaussian 09
title: 000295195
version: EM64L-G09RevD.01
frameworkgroup: C1[X(C13H11Cl2NO2S)]
method: RPBEPBE
basis: SDD
operation: Freq
keyword: #p
keyword: freq=noraman
keyword: PBEPBE/SDD
title: #p freq=noraman PBEPBE/SDD
converged: YES YES NO NO
title: Mulliken charges:
elementType: Cl Cl S O O N C C C C C C C C C C C C C H H H H H H H H H H H
charge: -0.064821 -0.021624 0.961258 -0.522998 -0.507539 -0.556410 0.236022 -0.086817 0.400974 -0.337909 -0.269215 -0.254553 -0.195330 -0.825033 -0.218290 -0.250494 -0.180748 -0.186092 -0.103894 0.311133 0.294574 0.294995 0.291402 0.262938 0.246194 0.236847 0.241954 0.261195 0.271301 0.270979
chargesum: 0.00000
title: Mulliken charges with hydrogens summed into heavy atoms:
elementType: Cl Cl S O O N C C C C C C C C C C C C C
charge: -0.064821 -0.021624 0.961258 -0.522998 -0.507539 -0.245277 0.236022 -0.086817 0.400974 -0.043335 -0.269215 0.040443 0.096072 -0.079054 0.023664 0.010701 0.090553 0.084887 -0.103894
polarizability: 2.17481914e+02 4.18072296e+00 2.22806252e+02 -2.76000417e+01 -4.07112872e+00 1.77203705e+02
1716.lowfreq: -4.1717 -3.3168 -0.0032 -0.0025 -0.0022 6.5552 15.7648 20.6572 47.1231
frequency: 15.5209 20.5979 47.1029 58.1661 79.6334 98.8283 120.7168 129.4568 146.0544 169.6833 203.3869 208.1642 226.7355 256.4283 263.0834 271.6272 309.9632 350.1734 366.7352 375.4370 392.2186 410.4474 413.4393 477.3963 488.0922 502.2144 504.5928 513.3158 569.4826 611.0440 621.2503 694.9963 702.6800 710.0540 763.4171 786.4429 803.4108 821.0470 831.0355 832.9981 848.8303 907.0762 958.4474 961.2591 973.0100 979.1328 981.0366 1001.4545 1038.9069 1042.4677 1066.5257 1066.6194 1105.2311 1130.4552 1175.5762 1189.7632 1213.1238 1244.9732 1275.8638 1282.2622 1371.6034 1378.2014 1380.7747 1402.7482 1426.8322 1447.7854 1448.0061 1474.9649 1485.1887 1555.9155 1565.2726 1590.8629 1600.0288 2972.8116 3044.4849 3113.8860 3150.9025 3153.5895 3163.5321 3175.1386 3179.0608 3182.7893 3184.9046 3417.3294
redmass: 9.9006 6.7139 4.1828 7.4912 5.7447 5.1226 8.7463 1.1855 6.7015 6.6764 9.7911 12.9948 4.7260 7.9916 5.1319 7.0289 5.4872 4.8275 7.3771 7.2805 6.7024 2.9631 5.4644 4.1891 4.4931 3.7696 3.8214 4.3217 5.5874 7.1226 6.2068 5.1097 5.0200 2.5523 1.8532 2.5172 2.6200 4.1337 1.3352 1.3313 4.2496 1.4027 1.3969 5.6130 1.4108 1.4155 6.4712 1.7228 1.5020 2.8186 2.1619 2.9965 1.3289 1.9706 1.1286 1.3730 1.9559 2.3179 1.7042 1.2336 4.2946 2.8888 11.4802 1.2303 2.1555 2.6715 2.1205 1.2123 1.0519 5.9275 6.1213 8.1716 6.8286 1.0408 1.0977 1.0942 1.0880 1.0900 1.0895 1.0928 1.0961 1.0976 1.0991 1.0754
irintensity: 0.1786 0.1629 0.3654 2.4558 3.1423 0.6621 2.2090 1.7844 0.6570 6.2501 1.4526 2.1955 0.9883 2.8070 8.1512 2.6482 7.5015 0.3643 13.9033 23.9842 17.8499 3.1413 71.3937 5.0520 28.3336 55.5403 50.0426 9.3813 12.7834 0.4979 8.6526 15.2661 18.4445 13.7500 65.6197 31.7333 29.7053 151.9789 14.6720 31.7018 53.1095 2.6676 2.3891 50.9182 2.4764 3.5253 31.2382 54.7544 4.7270 33.3927 7.1652 55.8339 5.0124 8.9806 7.1289 2.5646 0.9333 3.2449 0.2934 2.1201 6.9585 14.2269 3.3692 21.0206 27.7683 11.5645 48.8752 28.3294 15.1422 29.1489 32.8187 1.7093 3.4538 15.1347 15.8591 3.4776 7.8655 2.6360 1.3422 0.7817 0.4608 2.3280 4.1253 21.6782
temp: 298.150 k
press: 1.00000 atm
elementType: 17 17 16 8 8 7 6 6 6 6 6 6 6 6 6 6 6 6 6 1 1 1 1 1 1 1 1 1 1 1
symmnumber: 1
zpe: 547146.2 jmol-1
zpe.correction: 0.208397 hartree
zpe.thermalcorrener: 0.227329 hartree
zpe.thermalcorrenthalpy: 0.228274 hartree
zpe.thermalcorrgfe: 0.158562 hartree
zpe.sumelectzpe: -2023.825018 hartree
zpe.sumelectthermal: -2023.806085 hartree
zpe.sumelectthermalent: -2023.805141 hartree
zpe.sumelectthermalfe: -2023.874853 hartree
dipole: 0.1095 -3.8399 -0.3079
dipole: 3.8538
quadrupole: -132.7322 -160.6270 -120.1054
quadrupole: -4.1872 -6.2895 -1.8715
quadrupole: 5.0893 -22.8054 17.7161 -4.1872 -6.2895 -1.8715
hfenergy: -2024.0334147 hartree
pointgroup: C01 [X(C13H11Cl2N1O2S1)]
dipole: -0.021419 1.5098283 -0.1371075 debye
polarizability: 221.8900583|4.8336853|222.6949724|23.9675826|2.5640185|172.9068398 unknown
InChI: InChI=1S/C13H11Cl2NO2S/c1-9-12(15)3-2-4-13(9)16-19(17,18)11-7-5-10(14)6-8-11/h2-8,16H,1H3
charge 0 multiplicity 1
30 atoms
Cl 3.18979 3.024274 -1.030656
Cl -4.184016 3.019576 0.617865
S  -0.635812 -2.334633 -0.116901
O  -1.337804 -3.237061 -1.270431
O  -0.28195 -2.88218 1.366374
N  1.05662 -1.831554 -0.917913
C  1.790612 -0.792627 -0.289075
C  -1.675178 -0.766083 0.106462
C  2.00079 0.469865 -0.947198
C  2.344092 -1.059132 0.993482
C  2.815223 1.400002 -0.262938
C  -2.554022 -0.407484 -0.930512
C  -1.535445 -0.03492 1.298461
C  1.386647 0.740644 -2.306147
C  3.111609 -0.07582 1.6444
C  3.364685 1.163772 1.013424
C  -3.33189 0.760324 -0.768077
C  -2.310654 1.136586 1.453248
C  -3.188744 1.514786 0.416269
H  0.819741 -1.687268 -1.914042
H  2.17121 -2.039838 1.44508
H  -2.654866 -1.037573 -1.820341
H  -0.862991 -0.378176 2.090446
H  1.562458 1.779969 -2.620805
H  1.819924 0.085867 -3.08728
H  0.292195 0.574784 -2.292701
H  3.5399 -0.277873 2.631151
H  3.983006 1.926572 1.49395
H  -4.03769 1.072016 -1.542714
H  -2.233939 1.737381 2.363321
