program: Gaussian 09
title: 000295183
version: EM64L-G09RevD.01
frameworkgroup: C1[X(C14H11ClN2O4)]
method: RPBEPBE
basis: SDD
operation: Freq
keyword: #p
keyword: freq=noraman
keyword: PBEPBE/SDD
title: #p freq=noraman PBEPBE/SDD
converged: NO YES NO NO
title: Mulliken charges:
elementType: Cl O O O O N N C C C C C C C C C C C C C C H H H H H H H H H H H
charge: -0.064247 -0.329063 -0.218588 -0.206388 -0.202412 -0.431498 0.032790 0.492155 0.340460 0.272519 -0.551384 -0.343950 -0.361314 -0.799469 0.608203 -0.355655 -0.314548 0.221865 -0.216006 -0.223684 -0.240328 0.268399 0.245448 0.286744 0.233723 0.244221 0.237118 0.344876 0.301490 0.256427 0.234823 0.237273
chargesum: 0.00000
title: Mulliken charges with hydrogens summed into heavy atoms:
elementType: Cl O O O O N N C C C C C C C C C C C C C C
charge: -0.064247 -0.329063 -0.218588 -0.206388 -0.202412 -0.086622 0.032790 0.492155 0.340460 0.272519 -0.282985 -0.098502 -0.074571 -0.084406 0.608203 -0.355655 -0.013058 0.221865 0.040421 0.011138 -0.003055
polarizability: 3.04518300e+02 1.64806986e+01 1.79490681e+02 -9.99852745e+00 1.02754382e+01 1.30589793e+02
1716.lowfreq: -46.5575 -1.0768 -0.0017 -0.0015 0.0013 1.6602 3.3964 17.9356 26.1863
frequency: -46.4941 17.9195 26.1650 43.5547 50.0000 90.2240 94.5243 112.4327 133.4102 162.3496 184.7925 218.5614 241.3702 252.3528 275.9962 291.6907 310.5810 352.0041 371.4173 389.6803 419.4380 440.2591 444.5565 504.2352 538.1377 543.5033 573.5626 595.7698 625.8644 641.8713 660.3739 672.2402 687.9561 705.7814 728.6043 731.7460 741.8954 761.5401 772.3166 838.9735 846.5909 869.8768 889.8111 897.3530 948.4964 961.6770 985.3226 990.8273 1008.5094 1013.4338 1041.4382 1046.3010 1065.4462 1119.4805 1141.1693 1155.4730 1162.3074 1174.7443 1213.3048 1237.7401 1247.3994 1272.6684 1310.9806 1353.6990 1374.5570 1393.0231 1400.0627 1414.0164 1432.5769 1457.4764 1467.7510 1472.1675 1476.5346 1519.2896 1576.4145 1581.0112 1615.9421 1620.8001 1712.8101 2983.2182 3061.8882 3097.5478 3144.7941 3144.8346 3161.1475 3161.3442 3177.9534 3181.5928 3188.9018 3498.3158
redmass: 1.0212 8.3277 7.0426 8.1527 9.9689 4.6045 5.1727 10.0346 10.7248 5.6025 4.8724 6.4597 7.1706 8.7198 4.7707 5.5736 5.1108 7.4186 8.5533 6.3553 7.9019 3.3632 3.1945 6.7549 3.5888 6.4767 5.0695 6.4741 6.5291 4.6383 4.3265 6.9863 5.7895 2.3867 2.6708 4.1539 4.1204 1.2818 9.2213 1.3544 5.4694 1.3554 3.7627 1.7507 1.3595 2.8926 1.3358 1.3179 3.0942 2.3874 2.0561 1.5982 5.4174 2.2570 2.0108 1.6857 1.8320 1.0755 9.9988 2.1307 1.6213 1.8963 1.7254 6.5988 7.3835 4.8450 1.4410 3.1054 2.5670 2.1898 1.0772 2.1879 1.3225 2.4968 7.1516 5.1597 6.7240 6.4076 10.2061 1.0383 1.0966 1.0990 1.0867 1.0902 1.0919 1.0924 1.0973 1.0947 1.0967 1.0761
irintensity: 0.5323 0.8698 1.8624 0.9934 1.4045 0.8859 1.9258 2.1883 1.5505 0.4453 4.5499 1.8469 0.6394 0.7600 4.2249 5.9132 6.9334 4.1595 7.4922 1.5805 1.9795 10.5592 5.6946 2.8007 4.8156 1.9175 1.2849 5.1287 6.3034 1.4099 20.6952 16.3814 6.7196 32.8997 15.1334 9.8980 11.0250 119.4483 26.4996 37.4483 0.6135 2.9436 103.1020 44.1888 4.4107 181.7122 2.1180 1.5075 34.7795 85.3275 3.5880 17.2129 138.5306 243.7409 219.6401 45.3250 13.5448 0.4646 334.3764 34.7988 18.9011 68.8257 14.0933 78.5478 142.6176 9.7083 7.2533 180.1748 66.2394 19.9875 16.6744 13.4712 125.1581 517.5256 27.9876 22.1166 196.2029 33.9734 309.8242 16.0948 13.7680 15.7245 2.0102 11.9812 11.1887 1.7629 6.8651 3.7974 9.5556 81.4511
temp: 298.150 k
press: 1.00000 atm
elementType: 17 8 8 8 8 7 7 6 6 6 6 6 6 6 6 6 6 6 6 6 6 1 1 1 1 1 1 1 1 1 1 1
symmnumber: 1
zpe: 595247.9 jmol-1
zpe.correction: 0.226718 hartree
zpe.thermalcorrener: 0.244845 hartree
zpe.thermalcorrenthalpy: 0.245790 hartree
zpe.thermalcorrgfe: 0.177920 hartree
zpe.sumelectzpe: -1408.993824 hartree
zpe.sumelectthermal: -1408.975697 hartree
zpe.sumelectthermalent: -1408.974753 hartree
zpe.sumelectthermalfe: -1409.042622 hartree
dipole: -2.0642 -3.9030 1.8752
dipole: 4.7969
quadrupole: -85.7032 -132.7420 -131.4689
quadrupole: 13.3053 0.0560 3.9590
quadrupole: 30.9349 -16.1040 -14.8309 13.3053 0.0560 3.9590
hfenergy: -1409.2205422 hartree
pointgroup: C01 [X(C14H11Cl1N2O4)]
dipole: -0.7396955 1.6537712 0.5288097 debye
polarizability: 301.7351175|-29.1503619|147.6276509|3.0583163|23.4221578|165.2360053 unknown
InChI: InChI=1S/C14H11ClN2O4/c1-9-6-7-12(17(19)20)13(8-9)21-14(18)16-11-5-3-2-4-10(11)15/h2-8,16H,1H3
charge 0 multiplicity 1
32 atoms
Cl 3.668226 0.032207 2.680935
O  -0.619997 0.618814 0.78808
O  0.23973 0.574939 -1.423991
O  -2.34363 -2.727869 -1.35118
O  -0.5758 -1.973871 -0.134466
N  1.5974 0.320262 0.508847
N  -1.763996 -1.830377 -0.624328
C  -4.163037 1.622052 0.3818
C  -1.957744 0.517626 0.364437
C  -2.520679 -0.603248 -0.310056
C  -2.787189 1.606672 0.703727
C  -4.703678 0.505146 -0.314964
C  -3.894666 -0.587369 -0.656327
C  -5.037372 2.805115 0.744401
C  2.9057 0.226964 -0.021113
C  3.999922 0.087684 0.874192
C  3.190136 0.264425 -1.413332
C  0.429875 0.477958 -0.19685
C  5.327597 -0.01197 0.432485
C  4.521336 0.167494 -1.866458
C  5.593316 0.029796 -0.955749
H  -2.32269 2.451993 1.220692
H  -5.76549 0.496365 -0.584002
H  -4.297738 -1.456686 -1.182604
H  -4.508328 3.523931 1.391383
H  -5.363705 3.345956 -0.164201
H  -5.952471 2.478141 1.271071
H  1.501163 0.229493 1.525446
H  2.360211 0.362877 -2.11629
H  6.137083 -0.120099 1.159801
H  4.718711 0.196528 -2.943008
H  6.624909 -0.047251 -1.312677
