program: Gaussian 09
title: 000295177
version: EM64L-G09RevD.01
frameworkgroup: C1[X(C15H13ClN2O3)]
method: RPBEPBE
basis: SDD
operation: Freq
keyword: #p
keyword: freq=noraman
keyword: PBEPBE/SDD
title: #p freq=noraman PBEPBE/SDD
converged: YES YES NO NO
title: Mulliken charges:
elementType: Cl O O O N N C C C C C C C C C C C C C C C H H H H H H H H H H H H H
charge: -0.064939 -0.330812 -0.262307 -0.257893 -0.440552 -0.447788 0.493604 0.377107 -0.323335 -0.443254 -0.415941 -0.285243 0.587099 -0.359283 -0.319214 0.242704 -0.216095 -0.221251 -0.242432 0.210749 -0.799075 0.313490 0.219939 0.256193 0.301933 0.309778 0.342145 0.303913 0.256382 0.233477 0.237005 0.237519 0.269847 0.236532
chargesum: 0.00000
title: Mulliken charges with hydrogens summed into heavy atoms:
elementType: Cl O O O N N C C C C C C C C C C C C C C C
charge: -0.064939 -0.330812 -0.262307 -0.257893 -0.130774 -0.105643 0.493604 0.377107 -0.009845 -0.223315 -0.159748 0.016690 0.587099 -0.359283 -0.015301 0.242704 0.040287 0.012226 -0.005428 0.210749 -0.055177
polarizability: 3.71610824e+02 1.26817064e+01 2.05303831e+02 -4.65582255e-02 -7.06620937e-01 7.98834491e+01
1716.lowfreq: -81.4577 -3.9064 -0.0015 -0.0003 0.0005 2.2276 8.2289 14.5772 20.3897
frequency: -81.4535 13.8816 20.2888 46.6161 55.4517 69.3153 73.2949 99.1590 118.2418 146.9881 158.8873 192.0936 206.8252 252.9915 278.9843 303.7036 346.9582 369.2516 373.7061 378.8576 414.2428 425.8223 439.8071 497.2157 519.3771 538.9496 577.9297 581.6430 620.1957 638.7136 643.4257 665.1033 677.3634 707.8304 709.1494 719.3545 732.5230 761.4557 771.9825 825.4041 829.5517 856.9528 860.4838 870.7303 930.0111 948.7545 960.2176 966.4939 985.1718 987.5084 992.1044 1005.2828 1012.0574 1030.3637 1042.8542 1119.7483 1128.0059 1160.6734 1165.0384 1173.8009 1198.4191 1219.0323 1245.6007 1268.2888 1302.4918 1309.4192 1369.5921 1373.7782 1375.9042 1414.4006 1430.8295 1448.5583 1455.6154 1468.2443 1490.0610 1504.6382 1522.5491 1579.0545 1594.5477 1616.7071 1623.0136 1633.8847 1668.5680 2986.7291 3071.6072 3117.0323 3136.3097 3143.5260 3159.9546 3163.6480 3177.2771 3190.3013 3199.7840 3209.2963 3498.7350 3522.6393
redmass: 1.0618 4.9841 6.1806 7.2347 7.9132 5.3082 5.2644 5.0878 6.8546 9.1441 5.2652 5.8391 5.4169 10.2225 4.8978 5.8790 7.6902 5.9249 5.5885 5.7609 3.0930 7.3167 3.3910 5.4743 2.5685 3.5789 5.6653 3.0171 7.0653 1.1842 6.1601 3.5091 6.8709 2.6781 9.4886 3.7077 1.8237 1.2588 6.1875 4.8063 1.3490 1.5249 6.0705 1.3464 6.5698 1.3557 1.3236 8.5532 1.7055 1.3174 1.3111 2.8760 5.4295 1.6587 1.9792 1.3265 1.6228 3.2668 1.9149 1.0698 1.4961 3.5076 1.6188 2.0367 1.4137 1.7526 4.6577 6.8138 1.3222 3.9522 2.5759 1.1350 2.1930 1.0469 2.3863 2.1183 2.5936 5.2015 6.0590 6.6220 6.3115 5.0797 9.0051 1.0384 1.0984 1.0909 1.0978 1.0866 1.0918 1.0911 1.0978 1.0959 1.0952 1.0942 1.0760 1.0764
irintensity: 0.0004 3.7943 0.5146 0.5541 2.8933 4.2884 6.0080 0.0457 10.7579 0.2125 0.0777 0.0851 0.2069 0.0347 4.9707 6.7735 16.8981 2.3442 1.9370 4.9115 0.0994 1.4722 10.5650 1.6774 27.1158 7.7818 15.0485 0.3484 0.9133 63.8323 2.6175 1.1968 17.8740 33.0879 6.5868 0.0678 35.9761 133.5693 10.5271 6.1275 27.2567 88.3571 7.2687 5.9784 18.0358 5.4201 1.2931 167.6044 32.3877 2.4622 2.3683 42.8448 81.9213 8.0922 1.1240 38.1147 82.5145 752.2552 315.4178 1.1739 276.6055 122.1862 32.3241 15.9148 31.2243 26.2881 107.2585 173.1510 65.6557 17.5827 156.6203 47.2958 35.4535 19.9812 456.7801 797.9493 123.3734 13.0558 40.7378 132.4085 45.7177 127.1499 193.0081 9.4308 15.5980 21.3403 7.5097 3.6039 11.0559 3.2569 8.3344 10.9293 8.4832 3.6494 71.1114 11.9067
temp: 298.150 k
press: 1.00000 atm
elementType: 17 8 8 8 7 7 6 6 6 6 6 6 6 6 6 6 6 6 6 6 6 1 1 1 1 1 1 1 1 1 1 1 1 1
symmnumber: 1
zpe: 662066.2 jmol-1
zpe.correction: 0.252168 hartree
zpe.thermalcorrener: 0.270748 hartree
zpe.thermalcorrenthalpy: 0.271693 hartree
zpe.thermalcorrgfe: 0.201976 hartree
zpe.sumelectzpe: -1373.178430 hartree
zpe.sumelectthermal: -1373.159850 hartree
zpe.sumelectthermalent: -1373.158906 hartree
zpe.sumelectthermalfe: -1373.228622 hartree
dipole: -0.0216 -3.4690 0.1509
dipole: 3.4723
quadrupole: -96.2863 -125.9285 -134.1061
quadrupole: -20.5698 0.8334 -0.2366
quadrupole: 22.4874 -7.1549 -15.3325 -20.5698 0.8334 -0.2366
hfenergy: -1373.4305982 hartree
pointgroup: C01 [X(C15H13Cl1N2O3)]
dipole: 0.0313446 -0.7664659 1.1303984 debye
polarizability: 371.5996082|-14.4632218|115.4570577|2.35295|-56.0806931|169.7414381 unknown
InChI: InChI=1S/C15H13ClN2O3/c1-10(19)17-11-6-8-12(9-7-11)21-15(20)18-14-5-3-2-4-13(14)16/h2-9,17-18H,1H3
charge 0 multiplicity 1
34 atoms
Cl 4.425682 1.166534 -2.466472
O  0.237125 0.213507 -0.534951
O  1.230664 -0.937938 1.298105
O  -6.277108 0.993581 -1.280015
N  -5.322643 -0.212482 0.495165
N  2.464453 0.06395 -0.459212
C  -3.929477 -0.092413 0.223208
C  -1.138591 0.056138 -0.18809
C  -3.414134 0.619582 -0.894495
C  -3.026479 -0.720227 1.120497
C  -2.022301 0.686995 -1.089704
C  -1.632007 -0.655706 0.929432
C  3.800735 -0.219925 -0.097554
C  4.851124 0.232498 -0.942583
C  4.162809 -0.939895 1.074607
C  1.314996 -0.295246 0.225537
C  6.204167 -0.006384 -0.659612
C  5.52007 -1.184087 1.366806
C  6.545361 -0.723986 0.51006
C  -6.403488 0.305081 -0.225791
C  -7.765553 -0.040696 0.3786
H  -4.10371 1.104233 -1.586899
H  -3.412172 -1.271833 1.987736
H  -1.609118 1.229743 -1.945072
H  -0.949868 -1.140791 1.627569
H  -5.558297 -0.753385 1.330901
H  2.321638 0.592992 -1.32562
H  3.369171 -1.295193 1.734818
H  6.975624 0.361946 -1.341667
H  5.775031 -1.740456 2.274813
H  7.597681 -0.916055 0.740772
H  -7.926698 -1.134493 0.407193
H  -8.549046 0.414436 -0.2437
H  -7.860639 0.348275 1.409516
