program: Gaussian 09
title: 000027376
version: EM64L-G09RevD.01
frameworkgroup: C1[X(C16H16O2)]
method: RPBEPBE
basis: SDD
operation: Freq
keyword: #pfreq=noraman
keyword: PBEPBE/SDD
title: #p freq=noraman PBEPBE/SDD
converged: NO YES NO NO
title: Mulliken charges:
elementType: O O C C C C C C C C C C C C C C C C H H H H H H H H H H H H H H H H
charge: -0.189523 -0.190625 -0.417605 -0.416185 -0.509671 -0.510404 0.170771 0.171340 -0.188398 -0.176181 0.238748 0.288382 -0.546476 -0.382805 0.514499 -0.411642 -0.538285 -0.671159 0.214460 0.207508 0.214340 0.207492 0.237398 0.260513 0.237150 0.261558 0.290088 0.285245 0.244116 0.219296 0.212347 0.222612 0.222959 0.228140
chargesum: 0.00000
title: Mulliken charges with hydrogens summed into heavy atoms:
elementType: O O C C C C C C C C C C C C C C C C
charge: -0.189523 -0.190625 0.004363 0.005647 -0.011760 -0.011696 0.170771 0.171340 -0.188398 -0.176181 0.238748 0.288382 -0.256388 -0.097560 0.514499 -0.167527 -0.106642 0.002551
polarizability: 2.56986295e+02 -4.05547953e+00 1.97538769e+02 -4.23770870e+00 4.26386004e+00 9.70014844e+01
1716.lowfreq: -11.4252 -4.9529 -0.0007 -0.0004 0.0005 5.5335 20.8702 39.2730 75.7339
frequency: 20.2254 39.2283 75.7068 95.2284 97.4434 136.7665 162.3263 184.6730 220.4655 261.6357 273.8894 279.1880 314.0129 353.4292 358.9367 372.7487 398.9141 418.5158 442.3398 467.2725 499.1774 525.5126 578.3489 594.5711 651.9681 670.1050 699.1474 727.3679 739.1762 788.5577 797.7428 830.4025 848.7240 852.6232 877.8513 893.9634 907.8102 933.3309 954.5298 976.0956 985.6633 999.6564 1055.1114 1058.3987 1079.0274 1080.4797 1095.8165 1112.1629 1123.2731 1134.6012 1164.1311 1179.4468 1210.7163 1236.7453 1238.3175 1242.9996 1265.9214 1287.7058 1299.6074 1314.4452 1332.6450 1341.7465 1352.4581 1370.4601 1388.5959 1398.0618 1423.4884 1439.2765 1448.1725 1471.4810 1472.0860 1473.4455 1475.1529 1484.0682 1490.4099 1526.0547 1538.2350 1580.5626 1612.2032 1625.6418 2970.4856 2971.2245 2982.5932 2982.9458 2985.5425 2991.8974 3036.1767 3038.5640 3044.1703 3047.6652 3055.2522 3083.0558 3086.6588 3127.5893 3140.3219 3160.0882
redmass: 2.5440 4.8724 4.3637 3.4614 2.7560 4.4614 2.3793 4.1678 1.4363 3.1466 3.6416 2.0777 3.9064 3.5711 3.6609 6.2031 3.9860 3.4178 3.9452 6.4962 2.6837 3.6425 4.6783 4.0706 4.7921 5.5760 3.5070 4.4659 4.3904 1.1751 1.7720 4.0365 2.0048 2.9494 1.8381 1.6865 2.7402 2.7520 1.5208 2.5156 2.5763 1.3775 1.5721 2.0228 3.5743 2.0239 1.8887 2.0610 1.1685 1.6483 1.8025 1.7255 2.1381 1.3023 1.2753 1.6156 1.3090 1.6292 2.5257 2.1913 1.4436 1.4870 1.6391 2.5018 1.2000 6.2724 4.1950 1.1290 1.0784 1.0489 1.0890 1.1758 1.0889 2.2059 1.1572 9.9349 10.6411 7.7746 6.8267 7.3527 1.0680 1.0679 1.0358 1.0643 1.0599 1.0600 1.0906 1.0911 1.1019 1.0980 1.1035 1.1003 1.1014 1.0895 1.0917 1.0952
irintensity: 0.0608 3.8703 1.6501 0.2894 3.6064 0.0448 0.5832 0.5598 0.3200 0.1648 0.2932 1.3155 0.8971 4.3440 5.6570 15.4430 0.3548 0.2989 1.0735 1.3069 1.8852 5.1284 2.4425 5.3838 4.5810 3.0226 14.6148 3.5293 3.6284 4.1555 4.9973 36.6750 6.7321 3.3931 21.0902 4.7306 9.6834 2.8403 6.7317 5.0350 4.1991 1.6419 3.9881 25.1838 3.8404 0.6687 0.2963 0.0431 1.8423 2.1878 31.2713 8.0810 16.1856 6.8464 1.5321 7.4517 14.1482 8.5562 255.9258 115.1087 0.9584 4.2366 3.1219 24.5339 9.8362 2.2353 9.5647 8.1607 30.2332 14.7792 12.3411 3.0738 9.2705 2.8443 10.0681 41.0539 258.1774 35.0671 42.2686 42.3025 8.4481 4.7270 44.4776 28.8850 40.4468 32.4793 16.9657 3.8469 5.2435 62.0664 53.0794 53.7870 36.8344 13.6082 3.7968 7.0469
temp: 298.150 k
press: 1.00000 atm
elementType: 8 8 6 6 6 6 6 6 6 6 6 6 6 6 6 6 6 6 1 1 1 1 1 1 1 1 1 1 1 1 1 1 1 1
symmnumber: 1
zpe: 726328.6 jmol-1
zpe.correction: 0.276644 hartree
zpe.thermalcorrener: 0.292387 hartree
zpe.thermalcorrenthalpy: 0.293332 hartree
zpe.thermalcorrgfe: 0.232589 hartree
zpe.sumelectzpe: -768.482899 hartree
zpe.sumelectthermal: -768.467155 hartree
zpe.sumelectthermalent: -768.466211 hartree
zpe.sumelectthermalfe: -768.526954 hartree
dipole: 0.9659 -0.2531 0.0796
dipole: 1.0017
quadrupole: -81.0139 -118.7661 -106.1283
quadrupole: 4.5123 -0.7512 -0.9693
quadrupole: 20.9556 -16.7967 -4.1589 4.5123 -0.7512 -0.9693
hfenergy: -768.759543 hartree
pointgroup: C01 [X(C16H16O2)]
dipole: 0.3786692 0.1038277 -0.0337081 debye
polarizability: 256.9221822|4.7832427|197.6775667|3.3554795|3.8386586|96.9268003 unknown
InChI: InChI=1S/C16H16O2/c1-2-10-7-8-13-14(9-10)16(18)12-6-4-3-5-11(12)15(13)17/h7-9H,2-6H2,1H3
charge 0 multiplicity 1
34 atoms
O  -0.233024 2.606205 0.211836
O  -1.022564 -2.804642 -0.126855
C  -4.250092 1.137673 -0.4745
C  -4.480504 -0.224842 0.215089
C  -2.919092 1.764114 -0.007574
C  -3.354408 -1.21394 -0.150079
C  -1.773632 0.769253 0.01895
C  -1.972658 -0.595502 -0.056105
C  -0.39696 1.343845 0.13647
C  -0.817412 -1.547914 -0.050324
C  0.770828 0.409606 0.156098
C  0.56326 -0.993904 0.056793
C  2.082465 0.922898 0.271175
C  1.679536 -1.863413 0.074207
C  3.206263 0.06089 0.288293
C  2.982567 -1.340482 0.188518
C  4.617646 0.620046 0.364947
C  5.207867 0.906023 -1.043598
H  -5.083642 1.831502 -0.259385
H  -4.226759 0.990031 -1.572724
H  -5.458901 -0.64957 -0.076156
H  -4.505149 -0.07753 1.313293
H  -3.031858 2.190558 1.011131
H  -2.628317 2.62418 -0.638833
H  -3.496252 -1.592631 -1.183944
H  -3.382343 -2.119012 0.484435
H  2.204846 2.009218 0.350413
H  1.498741 -2.94071 0.002204
H  3.842208 -2.021249 0.207047
H  4.618569 1.557517 0.952013
H  5.277127 -0.094124 0.893676
H  5.251242 -0.016565 -1.650329
H  6.231874 1.31308 -0.961543
H  4.587832 1.639689 -1.589342
