program: Gaussian 09
title: 000295192
version: EM64L-G09RevD.01
frameworkgroup: C1[X(C14H14ClNO2S)]
method: RPBEPBE
basis: SDD
operation: Freq
keyword: #p
keyword: freq=noraman
keyword: PBEPBE/SDD
title: #p freq=noraman PBEPBE/SDD
converged: YES YES NO NO
title: Mulliken charges:
elementType: Cl S O O N C C C C C C C C C C C C C C H H H H H H H H H H H H H H
charge: -0.028846 0.954244 -0.528814 -0.511324 -0.531231 0.187074 0.344829 -0.096997 -0.488114 0.457851 -0.388311 -0.392674 -0.848381 -0.253781 -0.189106 -0.805093 -0.184388 -0.190982 -0.102296 0.300194 0.290013 0.231881 0.233971 0.238298 0.237705 0.242592 0.295475 0.290655 0.235133 0.239898 0.221843 0.269791 0.268892
chargesum: 0.00000
title: Mulliken charges with hydrogens summed into heavy atoms:
elementType: Cl S O O N C C C C C C C C C C C C C C
charge: -0.028846 0.954244 -0.528814 -0.511324 -0.231037 0.187074 0.344829 -0.096997 -0.198101 0.457851 -0.156430 -0.158703 -0.129786 0.041695 0.101549 -0.108219 0.085403 0.077909 -0.102296
polarizability: 2.41103862e+02 -1.24573860e+01 2.19535721e+02 -2.46221937e+01 7.53288890e+00 1.68273043e+02
1716.lowfreq: -10.1854 -3.9903 0.0013 0.0025 0.0026 8.5148 12.6104 20.4451 32.7880
frequency: 11.0952 20.3744 32.6256 34.7825 68.2239 70.9866 114.1950 117.9781 132.3112 158.7987 167.0638 194.0394 205.1641 243.0771 260.7083 284.8125 296.0731 322.4441 343.5437 368.2690 381.1008 407.4324 410.7370 437.8554 459.1743 477.0628 487.5520 503.7777 559.3606 592.9014 611.1746 694.3253 701.7661 708.9379 724.6100 744.9157 803.7421 823.6072 826.3865 832.5198 833.5582 904.3879 930.4915 954.5684 955.7790 960.9145 972.1647 981.3310 995.6026 1011.3077 1041.7066 1042.5734 1048.5263 1065.7149 1103.4795 1119.2633 1167.2950 1174.0526 1204.2497 1251.2215 1261.0297 1281.0764 1296.1372 1373.4225 1377.4668 1380.5417 1396.9880 1398.8723 1411.9188 1447.7241 1466.9578 1474.6868 1475.4778 1480.7840 1496.4211 1565.4240 1569.1735 1591.2395 1618.3887 2965.1123 2978.7229 3036.3308 3060.2033 3088.1599 3090.1846 3117.7413 3141.6793 3152.7967 3157.2476 3162.2060 3177.1937 3181.5583 3388.8449
redmass: 3.8155 6.2713 1.1458 3.0514 6.5585 6.2714 4.4536 9.5924 3.8899 1.2724 3.2783 8.9463 13.4268 6.4900 6.6921 4.5864 3.1939 3.6445 4.0685 4.6147 10.2258 3.3643 6.2593 3.8247 3.2910 3.7221 3.7856 4.3112 4.4086 4.8298 7.1167 5.1585 5.0768 3.7603 3.1943 4.2823 4.1944 1.3619 1.3658 1.7490 1.4800 1.4392 2.3119 1.8562 1.5545 2.2661 1.4142 6.6399 1.7690 1.4708 1.6495 2.5171 1.5553 2.9906 1.3278 2.3374 1.6329 1.1283 1.4835 1.6526 4.2657 1.2328 1.3338 4.6299 2.8887 11.7384 1.3434 1.2246 2.5521 2.1205 1.0962 1.0541 1.0563 1.1097 3.0787 6.1395 5.3107 8.1936 6.4193 1.0392 1.0386 1.0975 1.0953 1.0961 1.0998 1.0873 1.0966 1.0898 1.0927 1.0895 1.0962 1.0975 1.0750
irintensity: 0.1109 0.1782 0.4861 0.2349 3.1898 1.6028 1.1171 2.3703 1.9903 3.0510 7.0623 1.4566 2.9007 7.2693 0.8453 0.8020 0.1288 3.8518 5.8691 2.7602 31.1767 15.3199 51.5413 10.3585 7.5948 4.1804 26.3471 103.4850 4.3602 10.6202 0.3713 14.8302 25.6273 2.0323 1.8497 4.2862 37.5560 50.7241 43.7625 121.5507 26.2110 5.3069 0.3889 17.4672 12.3207 20.0109 2.0706 34.5802 11.0063 2.6260 12.9781 22.3724 22.6836 55.5872 5.1673 5.7460 2.2724 7.0821 1.0436 1.9602 1.8832 2.1796 2.5780 2.2518 14.9581 1.9772 14.7323 10.2535 1.3001 51.7309 2.9466 7.5376 14.5110 27.8199 32.6133 31.4516 3.6743 1.8690 6.5185 23.8479 32.8343 18.3040 17.9778 13.0367 14.8723 10.0766 27.2087 2.7135 1.0279 1.1447 0.9249 2.7238 18.9543
temp: 298.150 k
press: 1.00000 atm
elementType: 17 16 8 8 7 6 6 6 6 6 6 6 6 6 6 6 6 6 6 1 1 1 1 1 1 1 1 1 1 1 1 1 1
symmnumber: 1
zpe: 642486.8 jmol-1
zpe.correction: 0.244710 hartree
zpe.thermalcorrener: 0.264376 hartree
zpe.thermalcorrenthalpy: 0.265320 hartree
zpe.thermalcorrgfe: 0.193082 hartree
zpe.sumelectzpe: -1603.666112 hartree
zpe.sumelectthermal: -1603.646447 hartree
zpe.sumelectthermalent: -1603.645502 hartree
zpe.sumelectthermalfe: -1603.717740 hartree
dipole: -0.5629 -5.3956 2.3124
dipole: 5.8972
quadrupole: -124.5813 -141.4000 -119.4725
quadrupole: -10.7892 -4.2343 7.2179
quadrupole: 3.9033 -12.9154 9.0121 -10.7892 -4.2343 7.2179
hfenergy: -1603.9108227 hartree
pointgroup: C01 [X(C14H14Cl1N1O2S1)]
dipole: -0.1385402 -2.1748597 -0.7960829 debye
polarizability: 245.5228678|6.7105064|215.4452755|-24.7336543|-5.5733717|167.9444827 unknown
InChI: InChI=1S/C14H14ClNO2S/c1-10-3-4-11(2)14(9-10)16-19(17,18)13-7-5-12(15)6-8-13/h3-9,16H,1-2H3
charge 0 multiplicity 1
33 atoms
Cl 4.52157 -2.724226 0.544178
S  0.390882 2.245766 0.23944
O  1.153663 3.460026 -0.527522
O  -0.276738 2.394432 1.71012
N  -1.075916 1.762883 -0.967833
C  -1.705724 0.513589 -0.708012
C  -1.553422 -0.610527 -1.584627
C  1.597872 0.785674 0.334189
C  -2.53282 0.428289 0.446308
C  -3.224693 -0.760883 0.764078
C  -2.278888 -1.782829 -1.271041
C  -3.08853 -1.867492 -0.116104
C  -0.662194 -0.543542 -2.812361
C  2.707797 0.792866 -0.528276
C  1.34258 -0.23538 1.265456
C  -4.124939 -0.836947 1.984905
C  3.61295 -0.289536 -0.458333
C  2.245718 -1.320864 1.326686
C  3.359539 -1.329128 0.461703
H  -0.633146 1.846127 -1.901177
H  -2.628134 1.317173 1.078626
H  -2.193377 -2.651986 -1.934305
H  -3.623534 -2.799588 0.102112
H  -1.01827 0.204021 -3.548437
H  0.381829 -0.28166 -2.550313
H  -0.636873 -1.517921 -3.327543
H  2.877421 1.634759 -1.207628
H  0.479811 -0.176961 1.935861
H  -3.800354 -0.133587 2.770791
H  -5.169225 -0.578616 1.722944
H  -4.137965 -1.853735 2.415977
H  4.497995 -0.319104 -1.099646
H  2.086016 -2.137991 2.035182
