program: Gaussian 09
title: 000295169
version: EM64L-G09RevD.01
frameworkgroup: C1[X(C16H17NO3)]
method: RPBEPBE
basis: SDD
operation: Freq
keyword: #p
keyword: freq=noraman
keyword: PBEPBE/SDD
title: #p freq=noraman PBEPBE/SDD
converged: YES YES NO NO
title: Mulliken charges:
elementType: O O O N C C C C C C C C C C C C C C C C H H H H H H H H H H H H H H H H H
charge: -0.352074 -0.265800 -0.265232 -0.455991 0.500489 0.500131 0.405099 -0.649791 -0.565653 -0.475447 -0.810548 -0.811431 0.479159 -0.432553 -0.347501 0.317221 -0.329059 -0.340390 0.236405 -0.537965 0.236538 0.255503 0.303068 0.225004 0.230566 0.230128 0.232948 0.232903 0.221091 0.225324 0.295310 0.331748 0.251846 0.241460 0.221479 0.221433 0.244580
chargesum: 0.00000
title: Mulliken charges with hydrogens summed into heavy atoms:
elementType: O O O N C C C C C C C C C C C C C C C C
charge: -0.352074 -0.265800 -0.265232 -0.124243 0.500489 0.500131 0.405099 -0.413253 -0.310150 -0.172378 -0.124850 -0.124488 0.479159 -0.207229 -0.052191 0.317221 -0.077213 -0.098930 0.236405 0.149527
polarizability: 3.38804782e+02 -5.77445250e+00 2.00874582e+02 5.14126821e-02 6.61031174e-02 8.99598383e+01
1716.lowfreq: -41.3615 -25.6502 -3.8093 -0.0012 -0.0006 0.0007 4.5524 9.1031 12.7600
frequency: -41.2989 -25.2150 10.2666 25.5206 51.1837 58.6490 66.4666 101.4176 142.0046 172.4718 182.1391 188.4469 214.7639 232.2038 240.3571 246.8641 271.7782 298.3509 338.6010 373.0639 415.5347 436.7849 447.6605 500.4587 507.2694 520.0958 522.5843 537.4182 569.2107 618.7558 629.1396 638.0544 684.1201 698.8217 704.0762 720.2265 753.7259 813.5521 832.3322 844.2606 866.6765 888.5929 891.1055 918.6540 940.7846 956.2938 964.3085 967.5086 988.0887 990.1093 1001.3216 1015.4492 1040.8281 1047.4459 1050.4830 1112.3766 1118.9779 1132.7347 1148.3782 1158.2466 1175.0312 1185.2044 1224.8458 1260.6271 1281.6391 1301.7551 1312.4311 1377.7498 1379.8577 1395.5086 1397.9907 1421.6778 1429.9515 1436.3316 1454.1901 1466.1435 1468.9987 1470.6610 1473.8414 1484.1697 1486.0609 1499.0164 1512.6102 1595.1199 1599.5069 1621.9236 1632.2548 1672.6007 2959.4085 2977.9601 2979.3548 3046.4535 3057.1160 3058.7477 3085.5077 3086.4815 3121.5658 3123.0138 3124.8172 3149.8001 3159.0545 3171.0859 3190.0340 3194.1230 3546.5721
redmass: 1.0240 1.0297 3.6957 6.4106 4.9329 6.0510 5.1107 4.0394 4.4383 3.6584 5.1947 3.3454 3.0077 3.8347 1.6675 2.2298 3.1191 5.1295 6.1947 5.3480 3.0886 5.2598 3.1923 4.8234 5.1103 2.9285 2.4596 4.7534 4.2145 6.7685 7.1705 1.4974 3.4660 2.2557 8.7578 3.6776 5.8378 1.2857 1.6221 5.8232 1.3969 1.3195 6.3367 1.3619 1.3658 3.5570 1.3166 2.4385 7.8987 4.6010 2.6337 1.4577 2.5000 1.5422 1.5881 1.2605 1.3382 1.6915 3.3156 1.3529 1.4001 1.2428 2.4946 2.4832 1.2950 3.8622 1.5236 5.4612 5.6209 1.2781 1.2770 3.6875 2.1197 1.1909 2.2071 1.0502 1.0453 1.0460 1.0821 1.3418 1.2734 1.9960 2.6073 5.8282 5.7656 6.4991 6.4537 9.4373 1.0329 1.0371 1.0370 1.1038 1.0977 1.0977 1.0989 1.0991 1.0899 1.0917 1.0994 1.0923 1.0892 1.0948 1.0949 1.0926 1.0760
irintensity: 0.5295 0.4239 0.0123 1.2805 0.2760 4.1416 1.8801 8.7742 6.9808 0.0227 0.4475 3.0849 0.0003 1.1050 0.2998 0.3636 1.4933 2.6280 5.2023 3.7333 0.0114 7.1386 4.5379 10.9994 14.0024 4.2560 26.1339 0.7948 1.9243 5.5612 7.1937 28.9714 34.6223 40.8518 13.6881 0.3399 10.0437 11.1537 100.0968 1.1520 40.7516 0.0801 28.7831 16.0311 0.9301 24.8615 3.0448 136.6439 32.7958 1.4287 21.0706 5.9066 202.0439 1.3186 27.4527 0.1723 34.8010 260.6840 728.4404 47.6560 24.7942 7.6212 194.6359 16.5938 3.2116 215.6125 0.2703 85.7054 16.8206 6.8661 17.4868 77.6454 49.9854 18.2972 1.8141 13.3511 6.7625 19.3915 44.7251 25.2647 197.9640 17.6597 764.3258 48.0824 54.3301 41.2576 2.9456 251.1043 72.8274 44.0575 27.8883 50.4851 18.4721 22.1894 17.1069 24.3390 18.6522 24.3554 26.1627 4.0281 10.8322 6.1942 5.0059 5.3896 31.1655
temp: 298.150 k
press: 1.00000 atm
elementType: 8 8 8 7 6 6 6 6 6 6 6 6 6 6 6 6 6 6 6 6 1 1 1 1 1 1 1 1 1 1 1 1 1 1 1 1 1
symmnumber: 1
zpe: 770728.8 jmol-1
zpe.correction: 0.293555 hartree
zpe.thermalcorrener: 0.311657 hartree
zpe.thermalcorrenthalpy: 0.312601 hartree
zpe.thermalcorrgfe: 0.244832 hartree
zpe.sumelectzpe: -898.889082 hartree
zpe.sumelectthermal: -898.870980 hartree
zpe.sumelectthermalent: -898.870036 hartree
zpe.sumelectthermalfe: -898.937805 hartree
dipole: -0.1969 -0.5298 0.0121
dipole: 0.5653
quadrupole: -94.2814 -103.3109 -123.4401
quadrupole: -10.4790 -0.0337 0.0450
quadrupole: 12.7294 3.6999 -16.4293 -10.4790 -0.0337 0.0450
hfenergy: -899.1826368 hartree
pointgroup: C01 [X(C16H17N1O3)]
dipole: 0.0858968 0.1704007 -0.1142436 debye
polarizability: 338.1009686|-9.9924888|164.7474699|5.5435179|-52.4771418|126.7907641 unknown
InChI: InChI=1S/C16H17NO3/c1-11-8-12(2)10-15(9-11)20-16(18)17-13-4-6-14(19-3)7-5-13/h4-10,17H,1-3H3
charge 0 multiplicity 1
37 atoms
O  -1.295086 0.785067 -0.330934
O  6.501351 -0.087329 0.252587
O  -0.142328 -0.930019 0.869903
N  0.94088 0.785792 -0.346761
C  -4.970122 1.039775 -0.471399
C  -4.427199 -0.942212 0.905133
C  -2.644971 0.409357 -0.055179
C  -5.373703 -0.073868 0.30921
C  -3.587788 1.274922 -0.649577
C  -3.041304 -0.699705 0.72212
C  -5.995255 1.965652 -1.104836
C  -4.875684 -2.131848 1.738041
C  2.321221 0.495087 -0.146982
C  3.267838 1.359013 -0.76356
C  2.782061 -0.597759 0.626605
C  5.105137 0.04287 0.164157
C  4.645104 1.137006 -0.610829
C  4.168309 -0.821122 0.780209
C  -0.148059 0.094907 0.147764
C  7.02316 -1.203798 1.043203
H  -6.443835 -0.266207 0.453911
H  -3.229541 2.122119 -1.243738
H  -2.294022 -1.355308 1.171831
H  -7.02485 1.637926 -0.881706
H  -5.88381 3.002078 -0.734743
H  -5.882536 1.998604 -2.20462
H  -4.505435 -3.081937 1.309743
H  -4.483757 -2.067824 2.770218
H  -5.975804 -2.192842 1.796612
H  2.924148 2.20964 -1.365461
H  2.059428 -1.264146 1.101826
H  0.710233 1.599829 -0.92022
H  5.380397 1.796287 -1.080981
H  4.497221 -1.672676 1.383018
H  6.702981 -2.178297 0.625388
H  6.704218 -1.132263 2.101427
H  8.1176 -1.115272 0.97952
