program: Gaussian 09
title: 000295201
version: EM64L-G09RevD.01
frameworkgroup: C1[X(C22H21NO)]
method: RPBEPBE
basis: SDD
operation: Freq
keyword: #p
keyword: freq=noraman
keyword: PBEPBE/SDD
title: #p freq=noraman PBEPBE/SDD
converged: NO NO NO NO
title: Mulliken charges:
elementType: O N C C C C C C C C C C C C C C C C C C C C C C H H H H H H H H H H H H H H H H H H H H H
charge: -0.249148 -0.450660 -0.584214 0.494540 0.522923 0.197306 0.294642 0.319047 -0.424865 -0.335376 -0.386286 -0.445527 -0.563107 -0.349594 -0.393386 -0.227522 -0.234638 -0.239348 -0.227803 -0.239795 -0.668610 -0.252798 -0.243794 -0.243368 0.192780 0.316249 0.191054 0.232851 0.227545 0.249602 0.280129 0.218808 0.306054 0.229698 0.225157 0.224082 0.227129 0.223669 0.233387 0.219247 0.223077 0.228151 0.226590 0.229113 0.227008
chargesum: 0.00000
title: Mulliken charges with hydrogens summed into heavy atoms:
elementType: O N C C C C C C C C C C C C C C C C C C C C C C
charge: -0.249148 -0.134411 -0.391434 0.494540 0.522923 0.197306 0.294642 0.319047 -0.197319 -0.085774 -0.106158 -0.226719 -0.139201 -0.043541 -0.163688 -0.002365 -0.010557 -0.012219 -0.004133 -0.011644 0.007101 -0.026208 -0.014681 -0.016360
polarizability: 2.83485346e+02 2.73223356e+00 2.29314648e+02 -1.04094956e+00 8.65260001e+00 2.26088909e+02
1716.lowfreq: -2.4859 -0.0008 -0.0006 -0.0002 4.1150 5.1181 13.6406 23.7143 34.1634
frequency: 12.7309 23.6381 34.0578 36.2546 57.1574 60.9227 73.0014 99.7668 118.5859 127.3266 167.8780 200.2133 205.2493 218.8912 241.9771 257.6826 281.6073 307.7663 327.2365 349.3769 403.6395 404.5342 417.7678 468.6474 477.3395 486.3906 520.2684 545.5664 570.2819 580.0490 614.3859 615.5176 637.5993 642.7343 692.7560 700.1354 707.7346 719.1180 748.9062 754.7642 762.9823 768.9897 786.9743 806.2098 812.5200 842.1497 855.4009 857.6679 869.0941 885.9061 910.0719 928.4732 949.7147 956.6777 967.0020 967.2611 982.9448 989.2195 990.9176 991.7308 995.4775 1001.9654 1026.3110 1027.9247 1028.6768 1051.3961 1062.6397 1078.3943 1087.5658 1114.5022 1151.3472 1170.9489 1172.3931 1173.9481 1179.9149 1189.3959 1194.5559 1194.7299 1197.4395 1234.7951 1242.5122 1263.6398 1283.7272 1300.7908 1315.3394 1335.1665 1340.9256 1377.7846 1379.6722 1384.3672 1396.6681 1437.3625 1439.2429 1440.8464 1455.2422 1473.5052 1478.9577 1480.7746 1488.5051 1498.9966 1515.8305 1589.1727 1592.5301 1593.3489 1606.7108 1610.6821 1615.2172 1627.4109 2947.2198 2981.9676 2986.3291 3033.2238 3076.8089 3085.3931 3107.0918 3113.0709 3118.5948 3125.2237 3125.5426 3136.6688 3137.5997 3139.0172 3148.5452 3156.5093 3159.1794 3162.8332 3173.1973 3194.4055 3545.9318
redmass: 5.1386 4.5342 3.8499 4.0087 4.7319 4.0418 4.0796 4.2721 3.8133 4.3029 3.6178 4.5224 2.8943 1.4752 3.7973 4.1283 4.5049 4.1615 5.3661 4.1569 2.8223 2.8112 3.0595 3.7090 3.4583 3.6775 3.6804 5.3583 4.0130 4.4554 6.4170 6.4025 2.7291 1.5546 5.9962 1.6578 1.8622 4.0337 3.3211 2.0844 2.4992 1.3269 1.3299 4.7311 2.5256 1.2602 4.2363 1.2584 3.9518 1.3663 1.7316 1.6103 3.1562 1.3753 2.3805 1.4399 1.3904 3.8860 4.0737 1.6958 1.3117 1.3226 2.2237 1.8614 2.1240 2.0431 1.9077 1.6349 1.6098 1.9754 2.0427 1.0762 1.1059 1.1128 2.3462 1.1247 1.2123 1.6531 1.9793 1.3450 1.7569 1.9498 1.5031 1.7100 1.4976 1.2619 1.3312 6.5896 6.4894 6.4947 1.1954 2.3962 2.1768 2.1446 2.0129 1.0477 2.2144 2.2321 1.0964 1.4785 1.5481 6.1858 5.9796 6.1001 5.9965 5.9108 6.1155 4.6155 1.0695 1.0358 1.0835 1.0911 1.0997 1.1002 1.0878 1.0873 1.0874 1.0865 1.0865 1.0900 1.0918 1.0925 1.0956 1.0979 1.0984 1.1014 1.0967 1.0949 1.0754
irintensity: 0.9097 0.1134 0.1539 0.0052 0.4730 1.0433 1.0349 1.9228 0.4895 2.2875 4.6576 2.3715 2.3166 2.1269 0.4892 0.3906 0.4984 2.0379 4.4184 2.6880 0.0457 0.2202 1.2057 5.8199 11.5870 1.8731 14.8806 9.5796 10.5661 17.6545 0.0520 0.6920 20.6875 38.6523 0.3435 56.5716 50.6096 26.2755 10.2495 23.7154 22.5936 89.5891 3.0592 3.2400 4.3715 0.0535 0.4801 0.2164 4.0075 1.8687 1.0493 2.5835 15.0803 4.6613 4.0564 0.5362 0.3096 0.5772 0.1116 0.0933 2.0672 1.1865 11.8624 4.6325 9.0673 18.9796 5.8747 0.4707 19.1651 8.0723 91.2066 0.1809 0.6449 0.1783 0.4733 1.9167 1.5475 9.2377 0.7397 0.4680 2.4973 19.7685 21.7813 64.1299 5.6093 3.3021 11.1277 46.7723 27.0844 3.0771 8.3834 204.8867 7.0863 5.6397 19.2511 10.4123 36.6228 29.1637 7.9487 149.5093 218.9575 12.6380 7.5033 71.5577 14.3707 4.4144 2.7093 77.3435 40.3847 28.6851 27.0592 14.8146 51.6860 31.8503 11.4667 8.0307 10.0525 0.7841 0.6761 16.3999 18.1391 32.3729 17.7596 42.8571 31.7405 28.6763 5.6481 8.6884 21.1692
temp: 298.150 k
press: 1.00000 atm
elementType: 8 7 6 6 6 6 6 6 6 6 6 6 6 6 6 6 6 6 6 6 6 6 6 6 1 1 1 1 1 1 1 1 1 1 1 1 1 1 1 1 1 1 1 1 1
symmnumber: 1
zpe: 965057.2 jmol-1
zpe.correction: 0.367571 hartree
zpe.thermalcorrener: 0.388732 hartree
zpe.thermalcorrenthalpy: 0.389676 hartree
zpe.thermalcorrgfe: 0.314396 hartree
zpe.sumelectzpe: -979.251517 hartree
zpe.sumelectthermal: -979.230356 hartree
zpe.sumelectthermalent: -979.229412 hartree
zpe.sumelectthermalfe: -979.304693 hartree
dipole: 0.8523 1.7974 3.0621
dipole: 3.6516
quadrupole: -132.0290 -138.3819 -130.0447
quadrupole: 1.6927 3.3347 -0.4894
quadrupole: 1.4562 -4.8967 3.4405 1.6927 3.3347 -0.4894
hfenergy: -979.6190881 hartree
pointgroup: C01 [X(C22H21N1O1)]
dipole: 0.3464312 0.6752491 1.2198171 debye
polarizability: 283.5593373|1.8798257|228.8613341|-0.8514767|8.729|226.4682317 unknown
InChI: InChI=1S/C22H21NO/c1-2-17-11-9-10-16-20(17)23-22(24)21(18-12-5-3-6-13-18)19-14-7-4-8-15-19/h3-16,21,23H,2H2,1H3
charge 0 multiplicity 1
45 atoms
O  0.060473 -0.902449 -1.536571
N  1.370688 -0.297443 0.31737
C  -1.068554 0.023108 0.462945
C  -1.509684 1.429324 0.009823
C  -2.195064 -1.017311 0.407165
C  0.163291 -0.453354 -0.35836
C  2.699255 -0.563323 -0.137703
C  3.785098 -0.172362 0.711157
C  -2.037309 2.319718 0.980524
C  -2.963145 -1.215517 -0.768454
C  -1.441159 1.855778 -1.341923
C  -2.474296 -1.808729 1.549046
C  3.563702 0.560717 2.031181
C  2.949213 -1.204557 -1.379297
C  5.102754 -0.445925 0.275956
C  -2.486384 3.608165 0.614583
C  -3.984678 -2.189206 -0.797321
C  -1.890335 3.144775 -1.707921
C  -3.49851 -2.783832 1.522551
C  4.277349 -1.457549 -1.782691
C  3.245159 2.070175 1.845156
C  5.36164 -1.081203 -0.959478
C  -2.414469 4.026244 -0.734283
C  -4.257956 -2.976615 0.346859
H  -0.767782 0.10427 1.526398
H  1.305315 0.09191 1.259076
H  2.761802 0.080819 2.633572
H  4.475741 0.464137 2.648089
H  -2.110382 1.997675 2.027289
H  -2.753188 -0.617939 -1.659671
H  -1.026179 1.18247 -2.099923
H  -1.887427 -1.665689 2.466065
H  2.105048 -1.486991 -2.010208
H  5.939905 -0.152068 0.921237
H  -2.890565 4.282167 1.378595
H  -4.570217 -2.333925 -1.712369
H  -1.829985 3.460978 -2.755567
H  -3.70118 -3.387752 2.414416
H  4.083267 2.57784 1.335733
H  3.086913 2.564725 2.821341
H  2.342236 2.231666 1.228051
H  4.459725 -1.951643 -2.743405
H  6.392618 -1.282402 -1.2701
H  -2.76138 5.025148 -1.021901
H  -5.053569 -3.729925 0.32137
