program: Gaussian 09
title: 000295171
version: EM64L-G09RevD.01
frameworkgroup: C1[X(C15H15NO4)]
method: RPBEPBE
basis: SDD
operation: Freq
keyword: #p
keyword: freq=noraman
keyword: PBEPBE/SDD
title: #p freq=noraman PBEPBE/SDD
converged: YES YES NO NO
title: Mulliken charges:
elementType: O O O O N C C C C C C C C C C C C C C C H H H H H H H H H H H H H H H
charge: -0.344650 -0.264117 -0.267639 -0.266235 -0.456296 0.483552 -0.458787 -0.322920 0.322214 0.364379 -0.325683 -0.349772 0.317507 -0.387326 -0.309124 -0.324199 -0.337243 0.236595 -0.537932 -0.537699 0.221213 0.299012 0.241789 0.251272 0.331119 0.252800 0.300593 0.253432 0.241792 0.219435 0.219453 0.245895 0.221499 0.244610 0.221460
chargesum: 0.00000
title: Mulliken charges with hydrogens summed into heavy atoms:
elementType: O O O O N C C C C C C C C C C C C C C C
charge: -0.344650 -0.264117 -0.267639 -0.266235 -0.125177 0.483552 -0.237574 -0.023908 0.322214 0.364379 -0.083894 -0.098500 0.317507 -0.134526 -0.008531 -0.070767 -0.095450 0.236595 0.146851 0.149870
polarizability: 3.59228628e+02 -6.18623917e+00 1.75074458e+02 -4.83318888e-02 2.35600813e-01 8.19891079e+01
1716.lowfreq: -2.0744 -0.0007 0.0008 0.0010 4.9868 12.7027 20.4764 25.2082 49.3381
frequency: 18.2275 24.9758 49.3218 54.8900 60.0404 90.1275 108.0505 142.1631 160.2117 180.7663 181.4762 215.0876 242.0132 248.6561 264.7824 324.4863 357.1192 365.2428 373.9620 411.0768 415.8427 418.5775 454.2549 504.0426 513.6659 522.9546 558.5041 616.8629 631.0173 635.7739 682.2017 688.3167 713.2473 716.0184 720.0185 754.4379 801.7236 802.1151 812.5289 831.7145 847.9286 860.5827 919.3332 947.0199 960.0443 960.2130 979.9555 988.2459 989.2201 999.9845 1004.3726 1108.2106 1112.6753 1113.0662 1120.1081 1148.7095 1153.5309 1158.6604 1166.2656 1181.9439 1186.3605 1223.0724 1236.7005 1269.4178 1296.9875 1306.6544 1373.6267 1378.0380 1421.1415 1427.2334 1435.1092 1437.5063 1466.1234 1467.8972 1472.3300 1474.7175 1487.4230 1498.2577 1517.4268 1589.8574 1594.1743 1619.2924 1634.0952 1672.6300 2956.7345 2958.4584 3043.0171 3045.4348 3116.8161 3124.3860 3124.7285 3156.0586 3159.4137 3162.7049 3164.5397 3177.3935 3192.4563 3205.7817 3546.7204
redmass: 4.5996 4.6301 5.6692 4.6209 6.9223 3.6228 4.0339 4.6917 4.4999 6.3551 3.8236 3.7474 1.1630 1.2086 4.4586 6.5028 5.8037 6.3022 5.3230 6.1446 3.0435 3.1160 4.3053 4.6008 2.4924 2.4000 5.8169 7.3343 7.0968 1.5055 3.6238 6.1088 3.6532 8.5375 3.6506 5.8286 1.4186 5.7748 1.2499 1.6435 1.4911 6.0507 1.3838 1.3356 4.9740 1.5071 1.3087 8.3060 8.4860 2.7354 2.5585 1.3003 1.2604 1.2599 1.3413 3.4809 1.3466 1.3329 1.8495 1.2741 1.5831 2.4310 4.8213 2.5737 1.2750 1.3439 6.2202 7.1389 3.7284 3.9652 1.1803 1.1684 1.0502 1.0500 1.1625 1.0733 1.8952 2.0984 2.6558 7.8218 5.6853 6.3377 6.4156 9.3590 1.0332 1.0329 1.1038 1.1038 1.0899 1.0993 1.0990 1.0881 1.0899 1.0906 1.0931 1.0975 1.0955 1.0944 1.0761
irintensity: 4.4466 1.2385 0.7163 0.2665 0.5492 8.1933 3.0466 3.2182 6.7465 2.3437 0.5766 6.0577 0.3620 0.0394 4.7263 3.1167 0.1312 0.1765 3.6186 17.6737 0.0013 0.1400 0.0842 33.6004 6.0256 42.0533 1.1393 6.2695 0.3531 30.5117 59.5177 22.5260 0.8700 21.8046 0.0629 0.8805 44.2997 4.4766 0.3584 93.9370 77.8803 5.2815 2.0303 2.0596 200.6879 35.5653 1.5826 67.9665 32.2356 71.7182 14.3002 54.5628 0.1755 0.2140 54.0785 930.2660 0.4789 0.5297 225.9613 72.9814 298.9535 108.1879 25.9710 45.3330 0.5113 10.9639 175.4661 9.1322 21.5524 23.9821 37.2573 10.5387 13.3270 13.4365 370.4512 24.2128 405.1192 40.0168 465.5127 0.2032 55.5839 14.1429 0.3564 249.6165 88.9675 65.1623 52.1366 51.0766 24.0660 29.5479 20.7056 8.9306 10.2131 6.1737 11.3944 5.0383 4.6840 5.5903 30.6283
temp: 298.150 k
press: 1.00000 atm
elementType: 8 8 8 8 7 6 6 6 6 6 6 6 6 6 6 6 6 6 6 6 1 1 1 1 1 1 1 1 1 1 1 1 1 1 1
symmnumber: 1
zpe: 711821.6 jmol-1
zpe.correction: 0.271119 hartree
zpe.thermalcorrener: 0.289795 hartree
zpe.thermalcorrenthalpy: 0.290739 hartree
zpe.thermalcorrgfe: 0.222045 hartree
zpe.sumelectzpe: -934.780269 hartree
zpe.sumelectthermal: -934.761593 hartree
zpe.sumelectthermalent: -934.760649 hartree
zpe.sumelectthermalfe: -934.829343 hartree
dipole: -1.1449 1.9901 0.0444
dipole: 2.2964
quadrupole: -81.8808 -105.5411 -122.6650
quadrupole: -23.9237 -0.1044 0.0056
quadrupole: 21.4815 -2.1788 -19.3027 -23.9237 -0.1044 0.0056
hfenergy: -935.0513877 hartree
pointgroup: C01[X(C15H15N1O4)]
dipole: 0.4575516 -0.6853715 -0.3703628 debye
polarizability: 359.3256723|-4.0730069|152.3540277|-1.9578137|39.8988365|104.612494 unknown
InChI: InChI=1S/C15H15NO4/c1-18-12-5-3-11(4-6-12)16-15(17)20-14-9-7-13(19-2)8-10-14/h3-10,16H,1-2H3
charge 0 multiplicity 1
35 atoms
O  -1.081398 -0.793016 -0.395658
O  6.538433 0.843145 0.585367
O  -6.650752 -0.05755 0.064775
O  -0.104576 1.100586 0.679512
N  1.148612 -0.650021 -0.306525
C  2.496688 -0.252703 -0.07234
C  3.524011 -1.104611 -0.545878
C  2.845675 0.946102 0.608802
C  5.225486 0.413375 0.329144
C  -2.460503 -0.476073 -0.207338
C  4.883691 -0.781386 -0.350616
C  4.199395 1.267795 0.803026
C  -5.248827 -0.129558 0.011033
C  -3.336657 -1.446392 -0.750213
C  -2.965992 0.669032 0.443887
C  -4.725709 -1.275071 -0.642025
C  -4.367371 0.837316 0.550234
C  -0.005535 0.012429 0.064174
C  7.629464 -0.011124 0.114492
C  -7.23904 1.105857 0.731071
H  3.266299 -2.032043 -1.073072
H  2.059103 1.607549 0.976811
H  5.65214 -1.461571 -0.729007
H  4.484521 2.185968 1.325422
H  0.998128 -1.529481 -0.805034
H  -2.916267 -2.32406 -1.249936
H  -2.286044 1.413219 0.859441
H  -5.421432 -2.012116 -1.053212
H  -4.747701 1.729358 1.056631
H  7.610201 -0.120657 -0.987828
H  7.591199 -1.012471 0.5870
H  8.551604 0.505686 0.41823
H  -6.937765 1.156067 1.795822
H  -8.326712 0.958442 0.660463
H  -6.956467 2.047981 0.221643
