program: Gaussian 09
title: 000295199
version: EM64L-G09RevD.01
frameworkgroup: C1[X(C21H18ClNO)]
method: RPBEPBE
basis: SDD
operation: Freq
keyword: #p
keyword: freq=noraman
keyword: PBEPBE/SDD
title: #p freq=noraman PBEPBE/SDD
converged: YES YES NO NO
title: Mulliken charges:
elementType: Cl O N C C C C C C C C C C C C C C C C C C C C C H H H H H H H H H H H H H H H H H H
charge: -0.066280 -0.256002 -0.457883 -0.580673 0.518619 0.497335 0.210805 0.321473 -0.444277 -0.424761 -0.331663 -0.382311 0.289189 -0.226499 -0.226905 -0.234405 -0.239042 -0.323377 -0.243031 -0.242844 -0.364793 -0.845868 -0.234494 -0.111178 0.188955 0.330611 0.218064 0.224869 0.250712 0.280671 0.224767 0.225543 0.225503 0.227326 0.312932 0.228418 0.229731 0.257276 0.250702 0.231785 0.234866 0.256134
chargesum: 0.00000
title: Mulliken charges with hydrogens summed into heavy atoms:
elementType: Cl O N C C C C C C C C C C C C C C C C C C C C C
charge: -0.066280 -0.256002 -0.127272 -0.391717 0.518619 0.497335 0.210805 0.321473 -0.226213 -0.199892 -0.080951 -0.101640 0.289189 -0.001732 -0.001362 -0.008902 -0.011716 -0.010445 -0.014612 -0.013113 -0.107517 -0.128515 0.021640 -0.111178
polarizability: 3.11221408e+02 -3.09058788e+00 2.10941712e+02 3.23734146e+00 -1.02640870e+00 2.27223162e+02
1716.lowfreq: -6.3234 -3.1859 0.0012 0.0019 0.0023 2.2276 4.7124 17.7686 26.2376
frequency: 4.5843 17.4513 25.8774 33.3943 53.9286 58.3142 63.5317 113.5437 142.0539 162.3507 176.7316 183.0081 199.9913 212.4203 231.6335 246.1356 278.6489 293.9076 326.2162 359.4112 388.7480 402.2966 404.1774 439.1907 445.8643 476.8247 499.2276 525.6940 538.9703 557.1622 608.0939 615.4899 615.8233 625.3350 656.2745 694.7344 702.4023 706.7982 721.8824 730.7013 754.5494 778.4891 805.3785 839.8780 843.7139 846.1175 856.4983 858.6030 868.6574 870.3440 912.1182 927.5948 954.0670 968.5070 977.2941 982.0639 988.7010 989.6338 991.4252 993.2196 1000.8345 1027.2708 1029.4769 1043.2201 1078.7275 1088.3131 1088.9844 1111.3407 1150.9981 1171.5840 1172.6402 1179.8216 1189.3211 1193.3645 1194.5627 1194.9945 1238.0388 1263.6782 1276.7711 1300.2152 1334.1693 1342.5011 1369.3334 1381.9121 1385.6623 1398.0731 1399.7760 1440.0546 1441.6524 1450.5821 1479.0053 1480.6444 1480.9717 1484.6867 1507.8960 1587.1963 1591.1795 1593.9563 1607.4439 1609.5931 1611.7141 1623.2600 2957.2227 2982.1098 3027.4308 3092.6720 3108.8430 3113.8275 3127.0625 3127.4623 3139.3819 3140.7872 3150.8893 3156.1852 3158.0911 3164.2953 3168.2220 3173.3097 3196.2556 3545.8623
redmass: 4.7713 5.5653 4.0080 4.0590 5.2882 6.7483 5.7722 6.5247 4.7262 3.3072 4.2475 2.6381 1.5700 4.9117 5.3679 4.5211 4.5474 5.3572 8.0635 5.2166 9.0325 2.7954 2.8514 3.8995 3.0593 3.4848 3.8117 5.1177 4.2649 4.0214 4.9013 6.3780 6.3421 1.2392 6.6136 4.3000 1.9628 1.8110 3.9296 3.7211 1.9905 2.5418 4.9982 1.3778 1.2742 4.0676 1.2810 4.0515 4.7417 1.3518 1.6515 1.5855 3.5985 1.3948 1.3209 1.3835 1.5485 5.2190 5.8889 1.3652 1.3246 2.2345 2.2494 1.5140 1.6294 1.9371 1.6323 2.1692 2.0639 1.0939 1.1180 2.2377 1.1425 1.9994 1.1792 1.8143 1.6632 1.5312 1.9199 1.7488 1.2611 1.3648 6.2406 7.0480 6.8103 1.2653 3.7155 2.1575 2.1607 1.8058 2.2223 1.4742 1.3635 1.5842 1.8446 6.4913 6.0458 6.1281 6.0741 7.1425 5.5960 4.3069 1.0401 1.0838 1.0980 1.0948 1.0878 1.0874 1.0864 1.0866 1.0920 1.0926 1.0954 1.0927 1.0976 1.1014 1.0913 1.0972 1.0954 1.0757
irintensity: 1.0727 0.0195 0.0084 0.0349 0.3083 2.2140 0.6763 4.8896 3.7460 1.1929 0.3363 1.1351 0.6409 3.8530 0.6174 0.6654 0.0678 3.9529 0.9204 0.5900 29.9031 0.1430 0.1217 0.0164 9.3794 4.8507 14.2014 3.0600 22.0849 0.8650 14.9695 0.4614 0.1395 43.4931 21.6092 4.6936 46.2243 57.1953 2.6533 43.1590 30.4304 23.1972 2.4327 47.6875 0.4600 30.0061 1.4301 6.5625 11.7768 16.2255 3.2093 3.2827 28.1227 0.1350 2.9427 0.6262 6.7560 0.6359 0.1866 0.0577 1.1418 11.4774 14.2733 6.5820 0.6327 18.7110 22.2100 0.2769 97.9377 0.1951 0.3905 5.7340 3.6566 9.1345 0.5658 23.2318 2.9667 1.0993 30.6790 44.5161 3.1470 5.4274 133.2415 1.0381 2.0957 17.5407 68.0583 2.8125 29.4700 84.1916 37.3498 101.2965 57.4954 108.8376 369.7010 40.5957 3.8397 5.2702 13.3821 9.4292 7.7210 64.4588 26.4738 27.6810 18.4978 17.8607 11.3218 8.7123 0.7250 0.7168 18.3599 32.5666 15.0801 4.0284 38.7176 30.2805 1.4437 5.9292 9.8294 20.4366
temp: 298.150 k
press: 1.00000 atm
elementType: 17 8 7 6 6 6 6 6 6 6 6 6 6 6 6 6 6 6 6 6 6 6 6 6 1 1 1 1 1 1 1 1 1 1 1 1 1 1 1 1 1 1
symmnumber: 1
zpe: 865324.8 jmol-1
zpe.correction: 0.329585 hartree
zpe.thermalcorrener: 0.350845 hartree
zpe.thermalcorrenthalpy: 0.351789 hartree
zpe.thermalcorrgfe: 0.274480 hartree
zpe.sumelectzpe: -1399.420211 hartree
zpe.sumelectthermal: -1399.398951 hartree
zpe.sumelectthermalent: -1399.398007 hartree
zpe.sumelectthermalfe: -1399.475316 hartree
dipole: 2.2021 0.8660 3.9204
dipole: 4.5791
quadrupole: -161.0211 -143.0272 -130.9876
quadrupole: -0.7286 -5.3334 -1.0068
quadrupole: -16.0091 1.9847 14.0244 -0.7286 -5.3334 -1.0068
hfenergy: -1399.7497959 hartree
pointgroup: C01 [X(C21H18Cl1N1O1)]
dipole: -0.7848656 -0.705975 1.4598803 debye
polarizability: 310.7633844|6.0353279|211.4806049|-5.000029|-2.5795203|227.1422922 unknown
InChI: InChI=1S/C21H18ClNO/c1-15-14-18(22)12-13-19(15)23-21(24)20(16-8-4-2-5-9-16)17-10-6-3-7-11-17/h2-14,20,23H,1H3
charge 0 multiplicity 1
42 atoms
Cl 7.045127 0.801909 -0.836822
O  0.072083 0.602769 -1.469564
N  1.196256 -0.072488 0.477628
C  -1.263028 -0.254606 0.42682
C  -2.259739 0.916315 0.41315
C  -1.852436 -1.551589 -0.162411
C  0.052272 0.142368 -0.290214
C  2.56121 0.148907 0.131361
C  -2.578967 1.574499 1.626716
C  -2.521136 -2.447822 0.710717
C  -2.864693 1.360519 -0.789339
C  -1.78436 -1.865347 -1.543714
C  3.552696 -0.192078 1.106568
C  -3.488264 2.656785 1.644969
C  -3.112971 -3.631673 0.218534
C  -3.76995 2.443523 -0.772814
C  -2.373355 -3.052244 -2.035281
C  2.945755 0.68744 -1.124696
C  -4.086952 3.094994 0.442488
C  -3.040623 -3.938893 -1.159847
C  4.914202 0.016461 0.790177
C  3.168422 -0.768386 2.459545
C  4.309539 0.88897 -1.423077
C  5.275811 0.549386 -0.461281
H  -1.033017 -0.459162 1.491568
H  1.037322 -0.459029 1.409473
H  -2.117273 1.23959 2.564874
H  -2.589891 -2.211474 1.780311
H  -2.618187 0.866659 -1.733442
H  -1.261515 -1.188028 -2.227104
H  -3.726977 3.15409 2.591853
H  -3.627575 -4.311351 0.907155
H  -4.229312 2.780047 -1.709073
H  -2.309717 -3.283897 -3.104509
H  2.174982 0.942877 -1.853219
H  -4.792085 3.933709 0.45148
H  -3.496813 -4.857689 -1.544906
H  5.687083 -0.238504 1.521662
H  4.065713 -0.970409 3.066218
H  2.534945 -0.071244 3.044494
H  2.621137 -1.727752 2.363482
H  4.605977 1.303947 -2.390334
