program: Gaussian 09
title: 000295165
version: EM64L-G09RevD.01
frameworkgroup: C1[X(C15H15NO4)]
method: RPBEPBE
basis: SDD
operation: Freq
keyword: #p
keyword: freq=noraman
keyword: PBEPBE/SDD
title: #p freq=noraman PBEPBE/SDD
converged: YES YES NO NO
title: Mulliken charges:
elementType: O O O O N C C C C C C C C C C C C C C C H H H H H H H H H H H H H H H
charge: -0.336004 -0.319133 -0.268016 -0.269057 -0.442668 0.303118 0.176284 -0.319780 0.365160 -0.322123 -0.234881 -0.249900 0.317157 -0.387141 -0.310409 -0.324252 -0.337550 0.231545 -0.527706 -0.537668 0.299100 0.367470 0.239960 0.227553 0.225764 0.254354 0.300505 0.252877 0.241109 0.226570 0.226775 0.244463 0.221069 0.221299 0.244159
chargesum: 0.00000
title: Mulliken charges with hydrogens summed into heavy atoms:
elementType: O O O O N C C C C C C C C C C C C C C C
charge: -0.336004 -0.319133 -0.268016 -0.269057 -0.075198 0.303118 0.176284 -0.020679 0.365160 -0.082164 -0.007328 -0.024137 0.317157 -0.132788 -0.009905 -0.071375 -0.096441 0.231545 0.170102 0.148858
polarizability: 3.24919496e+02 -4.32971824e+00 1.96048577e+02 -7.47646481e-03 -7.99808913e-01 8.18309047e+01
1716.lowfreq: -11.6880 -7.9611 -3.7578 -0.0008 -0.0004 0.0003 6.5819 22.9697 49.6306
frequency: 5.7993 22.9679 49.6238 61.7842 72.7080 93.3610 102.4437 126.1556 162.0506 186.2485 194.8303 214.9757 234.9763 242.1538 264.1501 308.9437 317.0051 329.7595 365.5267 416.9703 432.5784 453.7968 478.9444 500.1229 513.4005 556.0011 558.1500 595.5703 619.9315 671.2621 702.1350 711.6577 716.6188 727.0708 749.9747 761.3483 761.6703 803.5920 810.4222 831.2309 851.8503 863.5704 933.4440 946.4171 958.8824 960.5822 979.0225 989.1605 995.6836 1000.3078 1041.1679 1107.0054 1109.6042 1114.0373 1115.6914 1147.8318 1154.4238 1160.7841 1164.7262 1174.9185 1181.8185 1203.3150 1236.7524 1256.7908 1293.7569 1308.2773 1376.9739 1396.4264 1421.3892 1427.8177 1437.3569 1450.9539 1464.1602 1465.5371 1466.9624 1472.9559 1480.4569 1489.8255 1520.6460 1590.0677 1604.4787 1613.2318 1620.0433 1668.3206 2957.5584 2965.8431 3044.2199 3056.0347 3124.1714 3127.5930 3136.8454 3153.9195 3156.1788 3158.5057 3169.5838 3177.3835 3190.4601 3205.6118 3516.4145
redmass: 3.6257 6.1863 5.2528 7.4859 4.1186 3.8062 4.0112 4.7819 4.0859 2.2225 6.1157 4.0496 1.4631 1.2646 4.1250 3.8827 6.1708 5.8077 6.2776 3.0962 5.6247 3.2784 6.3021 4.7108 2.4941 5.2933 3.8667 6.5736 7.2592 6.9057 6.8440 3.5474 6.9614 2.8869 1.3598 1.8291 2.5549 6.2503 1.2599 1.6436 1.3879 6.1993 1.3516 1.3365 1.3462 8.2112 1.2972 8.7001 8.4961 2.6014 2.0591 1.4955 1.7055 1.2596 1.2581 1.6777 1.3391 2.3695 1.6191 1.0919 1.7650 2.5189 4.9103 1.9363 1.2756 1.7113 6.9213 6.3321 3.7044 1.4921 1.1778 1.8696 1.4743 1.0707 1.0496 1.1170 1.2767 2.1842 2.7759 7.9939 5.9533 6.4901 6.3376 9.8301 1.0331 1.0325 1.1039 1.1044 1.0992 1.1000 1.0857 1.0912 1.0881 1.0899 1.0974 1.0975 1.0956 1.0942 1.0759
irintensity: 2.1110 1.0018 1.0358 0.5230 0.0790 12.3125 0.7779 3.4803 2.2454 4.0353 4.2871 1.1238 1.1254 1.4960 2.1460 1.4194 3.1599 4.0963 0.1067 0.0810 9.0555 7.6984 11.9761 19.7248 18.2368 3.8640 1.3924 0.7479 3.8858 1.6665 6.4504 2.0178 14.1476 2.4995 29.0934 121.8874 77.6059 1.5205 3.2832 99.2177 1.6315 6.8454 7.3715 3.0661 4.6788 206.8570 2.2932 54.1291 73.9123 64.4409 17.4716 68.9260 12.4437 0.2308 0.1812 311.3839 6.0862 504.5219 146.0761 18.7011 280.1567 123.5175 36.3934 77.7759 2.6375 28.4643 8.5358 68.3666 29.7606 110.0743 42.7092 109.9779 217.4250 28.5122 13.3306 126.2370 94.1753 316.2409 396.0028 8.0414 23.5786 101.1205 23.8574 224.2850 72.0601 68.1911 50.8962 43.5297 28.3024 18.6693 0.7249 20.7055 9.5765 9.9418 19.7389 4.8342 5.9164 5.5339 81.1672
temp: 298.150 k
press: 1.00000 atm
elementType: 8 8 8 8 7 6 6 6 6 6 6 6 6 6 6 6 6 6 6 6 1 1 1 1 1 1 1 1 1 1 1 1 1 1 1
symmnumber: 1
zpe: 712290.4 jmol-1
zpe.correction: 0.271297 hartree
zpe.thermalcorrener: 0.289978 hartree
zpe.thermalcorrenthalpy: 0.290922 hartree
zpe.thermalcorrgfe: 0.221182 hartree
zpe.sumelectzpe: -934.784259 hartree
zpe.sumelectthermal: -934.765578 hartree
zpe.sumelectthermalent: -934.764634 hartree
zpe.sumelectthermalfe: -934.834374 hartree
dipole: 1.8824 1.6317 0.1138
dipole: 2.4938
quadrupole: -79.8514 -103.6189 -122.6250
quadrupole: 20.6202 -0.1877 -0.2539
quadrupole: 22.1804 -1.5871 -20.5933 20.6202 -0.1877 -0.2539
hfenergy: -935.0555557 hartree
pointgroup: C01 [X(C15H15N1O4)]
dipole: -0.7274306 0.5841211 -0.3037589 debye
polarizability: 324.8071981|4.6081286|181.0370383|6.1281002|-38.4113838|96.9547413 unknown
InChI: InChI=1S/C15H15NO4/c1-18-11-7-9-12(10-8-11)20-15(17)16-13-5-3-4-6-14(13)19-2/h3-10,16H,1-2H3
charge 0 multiplicity 1
35 atoms
O  0.733901 0.588011 -0.187531
O  -3.482414 1.730083 -0.797453
O  6.356731 0.344328 0.104516
O  -0.031647 -1.512246 0.644799
N  -1.468756 0.209768 -0.105956
C  -2.751699 -0.358775 0.080801
C  -3.857053 0.46663 -0.294748
C  -2.99812 -1.650698 0.598552
C  2.140116 0.385654 -0.056663
C  -5.18037 0.00751 -0.154422
C  -4.329167 -2.108482 0.737832
C  -5.415107 -1.289029 0.365602
C  4.953207 0.284831 0.075463
C  2.905027 1.516773 -0.430535
C  2.769687 -0.798418 0.382048
C  4.306164 1.467796 -0.365459
C  4.182957 -0.842619 0.446754
C  -0.248381 -0.370255 0.172138
C  -4.547883 2.640035 -1.218616
C  7.070522 -0.851118 0.55682
H  -2.150286 -2.277007 0.883328
H  -1.456905 1.158891 -0.491723
H  -6.024818 0.640951 -0.441834
H  -4.510101 -3.110741 1.139784
H  -6.443754 -1.647996 0.475606
H  2.388523 2.420246 -0.767755
H  2.174005 -1.66456 0.671978
H  4.917366 2.329442 -0.649169
H  4.660105 -1.76545 0.7895
H  -5.211418 2.895145 -0.370198
H  -5.143962 2.200072 -2.040906
H  -4.033508 3.544756 -1.574089
H  6.867386 -1.716976 -0.103635
H  6.802195 -1.110468 1.599833
H  8.13676 -0.586383 0.503341
