program: Gaussian 09
title: 000027361
version: EM64L-G09RevD.01
frameworkgroup: C1[X(C11H8ClNO2)]
method: RPBEPBE
basis: SDD
operation: Freq
keyword: #p
keyword: freq=noraman
keyword: PBEPBE/SDD
title: #p freq=noraman PBEPBE/SDD
converged: NO NO NO NO
title: Mulliken charges:
elementType: Cl O O N C C C C C C C C C C C H H H H H H H H
charge: -0.049555 -0.179989 -0.192105 -0.382654 0.039615 -0.361993 -0.531060 0.141297 0.448357 0.191953 -0.418494 -0.377417 -0.207575 -0.212768 -0.109059 0.289610 0.288593 0.263442 0.347130 0.245139 0.251086 0.258356 0.258091
chargesum: 0.00000
title: Mulliken charges with hydrogens summed into heavy atoms:
elementType: Cl O O N C C C C C C C C C C C
charge: -0.049555 -0.179989 -0.192105 -0.035523 0.039615 -0.072383 0.020975 0.141297 0.448357 0.191953 -0.173355 -0.126331 0.050781 0.045322 -0.109059
polarizability: 1.94329202e+02 -1.25253216e+01 1.19140302e+02 1.74580893e+00 8.85319595e+00 8.72990085e+01
1716.lowfreq: -16.5421 -3.0307 -0.0025 -0.0024 -0.0014 2.7809 9.5469 52.1992 66.1716
frequency: -15.5923 52.1935 66.1673 147.4143 153.0282 176.0073 225.4606 279.3271 310.0152 330.0986 379.0247 406.7205 412.5278 460.8495 513.0961 566.1218 600.4539 614.8224 626.8798 686.9009 710.8993 715.5743 725.9880 753.3011 816.7337 829.3893 830.3657 854.5479 892.9849 931.9402 953.4663 966.8180 974.5384 999.5223 1014.2617 1072.2013 1073.9815 1097.1367 1111.9586 1132.9093 1185.2049 1214.1678 1233.0813 1277.1771 1294.5472 1319.7214 1363.3806 1375.2332 1392.2238 1464.3138 1488.0668 1582.4732 1605.0099 1666.8629 1699.2389 3103.7646 3138.2163 3149.8690 3171.3050 3176.0373 3189.6463 3213.3139 3551.0129
redmass: 4.1931 8.9107 10.1314 9.8477 7.6095 6.1426 8.0560 5.7393 3.7727 6.6107 6.8862 3.2694 3.8767 6.6478 3.2022 4.5673 8.4592 5.5207 7.0474 1.3666 5.6621 3.6541 4.6021 3.9894 2.1135 1.5424 1.4287 2.0125 5.9608 4.6252 1.4093 1.3799 1.5506 3.2666 1.6901 2.0847 1.7298 1.5999 1.3670 2.3060 1.1166 3.3072 1.9632 8.7375 1.2656 1.6606 6.3498 3.2464 3.4258 1.1751 2.8735 7.7224 6.3198 7.8876 12.1842 1.0559 1.0897 1.0896 1.0956 1.0969 1.0949 1.1164 1.0794
irintensity: 0.1956 0.6179 0.5022 3.4840 4.7998 0.3065 0.7197 0.5484 0.8446 7.2657 15.3905 0.1796 0.8650 15.0728 25.1015 9.0771 13.8685 12.9525 0.4703 67.3385 7.1252 25.6699 16.8497 42.0574 16.0317 26.1735 13.4205 9.6581 2.1543 1.1076 0.9159 0.7235 39.9326 70.8354 19.8360 12.1245 70.2800 26.5003 8.1115 31.3466 0.0881 18.0630 2.8702 179.9030 2.4307 7.5625 1.2476 10.3560 9.2742 17.5531 71.2068 2.6754 14.0049 613.0716 128.8582 6.1450 6.9231 4.6805 4.2886 0.8458 0.0763 3.6526 58.6203
temp: 298.150 k
press: 1.00000 atm
elementType: 17 8 8 7 6 6 6 6 6 6 6 6 6 6 6 1 1 1 1 1 1 1 1
symmnumber: 1
zpe: 432566.6 jmol-1
zpe.correction: 0.164756 hartree
zpe.thermalcorrener: 0.176266 hartree
zpe.thermalcorrenthalpy: 0.177210 hartree
zpe.thermalcorrgfe: 0.126314 hartree
zpe.sumelectzpe: -1088.177174 hartree
zpe.sumelectthermal: -1088.165664 hartree
zpe.sumelectthermalent: -1088.164720 hartree
zpe.sumelectthermalfe: -1088.215616 hartree
dipole: 0.2507 -0.3387 2.1123
dipole: 2.1539
quadrupole: -108.9156 -96.1418 -89.8655
quadrupole: 8.0999 1.2936 5.0798
quadrupole: -10.6080 2.1658 8.4421 8.0999 1.2936 5.0798
hfenergy: -1088.3419301 hartree
pointgroup: C01 [X(C11H8Cl1N1O2)]
dipole: -0.0825975 -0.1719324 -0.8256586 debye
dipolederiv: -0.9027475 0.0498254 -0.1032608 0.0631725 -0.1117258 0.0333957 -0.1098541 0.0315425 -0.0961195 -0.5949837 -0.1521668 -0.0084837 -0.2496091 -0.9476304 -0.2697747 -0.0063342 -0.2939789 -0.4480546 -1.0363604 -0.4431663 0.12553 -0.38693 -0.6983159 -0.0174598 0.2307169 0.0647793 -0.3964157 -1.0353095 -0.437824 -0.0011786 -0.431682 -1.0265318 -0.1531419 0.0904771 -0.1410126 -0.4098846 0.1007324 0.0082491 0.0844792 0.1857087 -0.1383885 -0.2538777 0.0386456 -0.3048352 -0.1222532 -0.4275703 -0.0318916 0.2336841 -0.1268612 -0.0579328 0.0225587 0.3509172 0.0774437 -0.1321744 -0.0035927 0.0498822 0.0196186 0.1493315 0.0853034 0.0094523 -0.0476018 0.0385041 0.0141133 1.233589 0.4788614 -0.1985645 0.2803142 1.1751034 0.4476157 -0.3887135 0.37073 0.5255629 0.3392543 -0.0413663 0.0255972 -0.0822634 -0.0977997 -0.0382589 0.0115803 -0.0203207 -0.0745049 1.3069429 0.5094489 -0.3405999 0.6293767 1.3001603 0.2956819 -0.3846375 0.2572152 0.5216374 -0.0309903 0.0508112 -0.0212808 -0.0175731 -0.0077717 -0.0753669 0.0409992 -0.070578 -0.0687873 -0.019743 -0.0582608 0.0253611 0.0016317 0.0508527 -0.0780672 -0.0532871 -0.0554122 -0.0619304 -0.366002 -0.0445871 -0.0017839 -0.0439348 -0.0183747 -0.0507771 0.0137495 -0.0536452 -0.0645452 -0.3256074 0.10751 -0.0807433 0.1227449 -0.0375488 -0.0303326 -0.0788037 -0.0177949 -0.0926727 1.3012782 -0.0731039 0.1652593 -0.0958253 0.0861979 -0.0966137 0.1784706 -0.1016912 0.008448 0.0745456 0.020384 0.0253046 0.0404546 -0.0074808 0.0039806 0.0401551 0.02293 0.1122013 0.0767737 0.0427051 0.0777043 0.0514398 0.0815522 -0.0212917 0.0852676 -0.0256267 0.0038744 -0.0277643 0.0600213 -0.0569477 0.0375094 0.0324471 0.0525616 -0.0316554 0.0153494 0.0452879 0.1909036 -0.042062 0.0438312 -0.0765396 0.1898741 -0.0578656 0.0461942 -0.0465083 0.3093386 0.0047456 -0.0900884 0.04121 -0.0854567 0.0334231 0.0598626 0.0384124 0.0498005 0.1066136 0.0595391 0.0604414 -0.0474318 0.0574433 0.0245267 0.0747483 -0.0477053 0.064699 0.082681 0.0585767 0.0411419 -0.0355754 0.0415288 0.0361759 0.082315 -0.0391495 0.0796331 0.1102661 0.0237898 -0.0647648 0.0282707 -0.0639808 0.053884 0.0606555 0.0221565 0.0587769 0.1273182 unknown
polarizability: 194.6572786|11.4534791|117.7701795|3.4147524|-10.1215078|88.3410549 unknown
InChI: InChI=1S/C11H8ClNO2/c12-7-3-1-6(2-4-7)11-5-8(11)9(14)13-10(11)15/h1-4,8,13H,5H2
charge 0 multiplicity 1
23 atoms
Cl 5.197588 -0.36182 0.420195
O  -1.183603 2.272119 0.862708
O  -4.102157 -1.38137 0.421687
N  -2.903232 0.652128 0.666916
C  -0.859513 0.140529 -0.41155
C  -1.855339 -1.024275 -0.590201
C  -1.54374 -0.086108 -1.777553
C  -1.60813 1.176059 0.435842
C  0.619503 -0.006286 -0.223711
C  -3.093784 -0.676013 0.194881
C  1.160309 -1.094135 0.505623
C  1.496576 0.978615 -0.743126
C  2.553819 -1.211895 0.70428
C  2.891056 0.879626 -0.549009
C  3.398541 -0.219726 0.170939
H  -1.554457 -2.070983 -0.645009
H  -0.914472 -0.505053 -2.567844
H  -2.315682 0.612789 -2.113077
H  -3.612497 1.155193 1.205328
H  0.493336 -1.855638 0.925128
H  1.08921 1.83398 -1.29199
H  2.971626 -2.053361 1.264093
H  3.567344 1.641425 -0.94675
