program: Gaussian 09
title: 000295146
version: EM64L-G09RevD.01
frameworkgroup: C1[X(C15H13Cl2NO)]
method: RPBEPBE
basis: SDD
operation: Freq
keyword: #p
keyword: freq=noraman
keyword: PBEPBE/SDD
title: #p freq=noraman PBEPBE/SDD
converged: YES YES NO NO
title: Mulliken charges:
elementType: Cl Cl O N C C C C C C C C C C C C C C C H H H H H H H H H H H H H
charge: -0.010083 0.005335 -0.259497 -0.488625 0.337937 0.263674 0.486887 -0.482918 -0.380954 -0.457368 -0.848738 0.131242 0.290371 -0.814150 -0.326768 -0.357280 -0.083563 -0.200286 -0.105086 0.308418 0.227594 0.340093 0.233100 0.229603 0.226455 0.249574 0.234244 0.234159 0.219955 0.247427 0.284628 0.264620
chargesum: 0.00000
title: Mulliken charges with hydrogens summed into heavy atoms:
elementType: Cl Cl O N C C C C C C C C C C C C C C C
charge: -0.010083 0.005335 -0.259497 -0.148532 0.337937 0.263674 0.486887 -0.174501 -0.153360 -0.224268 -0.143105 0.131242 0.290371 -0.125791 -0.079341 -0.072652 -0.083563 0.064334 -0.105086
polarizability: 3.30964811e+02 -7.54342271e-01 2.06060308e+02 6.12539411e+00 1.45166403e+00 8.85620776e+01
1716.lowfreq: -4.2647 -1.4948 -0.0014 0.0016 0.0020 5.1284 18.4780 29.3273 32.2184
frequency: 18.3449 29.3235 32.1630 48.8181 80.4728 96.6974 127.8850 138.7059 162.2848 181.1838 184.2518 200.1270 237.9974 277.5849 292.8684 302.6500 327.5365 344.5817 384.7196 426.9560 438.4896 447.3836 451.2438 462.6750 515.8653 556.4605 583.1482 601.5880 643.9391 660.3748 685.2453 714.0510 729.8357 733.1240 736.4205 787.2025 816.5745 842.9960 875.1829 883.6065 927.8414 931.7736 953.8339 979.5875 993.4378 1002.2841 1012.8749 1041.9058 1051.0799 1078.7738 1122.4419 1137.1899 1147.0536 1169.5756 1212.8144 1247.4943 1259.8279 1276.2184 1297.0338 1359.0287 1371.8561 1380.4035 1395.6225 1398.3788 1422.8856 1446.6250 1464.2007 1469.2672 1477.2954 1481.1909 1487.8795 1531.7225 1555.9116 1589.4487 1591.7507 1605.6365 1628.5720 2949.7897 2979.2789 3017.4190 3058.4595 3086.0845 3086.2522 3120.4344 3144.2908 3145.1645 3163.0113 3178.2442 3180.5310 3543.3911
redmass: 5.0662 6.7120 1.0746 6.3512 6.1983 6.4099 3.0797 5.2297 5.3142 1.1703 7.4993 6.8884 4.3625 5.5004 4.8965 3.7946 3.8674 7.2912 8.7054 4.3049 4.3079 3.2309 2.9480 4.5028 6.0217 6.6752 2.8401 5.8382 1.5550 4.5634 5.3586 4.5949 3.6308 5.3566 3.8080 6.1249 1.2582 1.3786 1.7963 4.8087 1.3186 2.2759 1.3705 1.3606 1.7647 5.4414 1.4975 1.5273 1.5582 3.2812 2.2603 1.7786 1.5256 1.9178 1.7575 2.2562 1.6951 2.2146 1.7004 4.2041 4.9850 5.5366 1.2697 1.2373 4.0419 2.1134 1.7498 1.0459 1.2418 1.0483 1.4041 2.2358 7.6152 6.1112 6.6453 5.2818 5.7422 1.0403 1.0370 1.0979 1.0976 1.0961 1.0971 1.0874 1.0918 1.0968 1.0886 1.0927 1.0973 1.0753
irintensity: 0.2371 0.3080 0.8213 0.3154 6.3530 1.0593 1.3356 3.5382 0.7481 0.7934 0.5979 0.4042 4.1832 0.3073 2.1646 1.0163 2.5324 4.1088 6.3118 4.4593 10.9472 6.0835 9.8513 0.2610 19.3413 11.6878 2.3147 4.4315 54.6103 9.6939 8.2811 0.2172 15.8059 8.2573 17.8010 10.4479 39.4871 21.5898 16.6702 34.9401 10.2808 2.8232 4.0953 2.7529 12.6815 46.1924 2.0522 3.2365 18.9180 10.6403 51.8611 11.7598 1.9514 3.0054 10.9578 112.3101 44.6048 2.9855 23.3962 6.7111 38.8602 8.2385 14.9825 17.0879 142.6415 149.1630 49.6767 12.6786 72.2744 17.3975 12.6561 296.9826 57.4337 77.6380 15.1021 56.8977 9.2241 35.4001 35.4999 23.0702 19.0832 1.9035 39.3533 12.1620 4.6830 30.2957 0.3737 7.1350 2.2009 19.6178
temp: 298.150 k
press: 1.00000 atm
elementType: 17 17 8 7 6 6 6 6 6 6 6 6 6 6 6 6 6 6 6 1 1 1 1 1 1 1 1 1 1 1 1 1
symmnumber: 1
zpe: 629317.2 jmol-1
zpe.correction: 0.239694 hartree
zpe.thermalcorrener: 0.257944 hartree
zpe.thermalcorrenthalpy: 0.258888 hartree
zpe.thermalcorrgfe: 0.190537 hartree
zpe.sumelectzpe: -1628.170791 hartree
zpe.sumelectthermal: -1628.152541 hartree
zpe.sumelectthermalent: -1628.151597 hartree
zpe.sumelectthermalfe: -1628.219949 hartree
dipole: 1.4794 1.7652 -0.9424
dipole: 2.4885
quadrupole: -124.1775 -119.4146 -128.4895
quadrupole: 9.2207 1.8425 0.3143
quadrupole: -0.1503 4.6126 -4.4623 9.2207 1.8425 0.3143
hfenergy: -1628.4104857 hartree
pointgroup: C01 [X(C15H13Cl2N1O1)]
dipole: -0.688375 -0.64231 0.2686201 debye
polarizability: 326.2484483|-30.1998743|141.3506898|-5.8937686|-57.6643736|157.9880585 unknown
InChI: InChI=1S/C15H13Cl2NO/c1-9-3-4-10(2)14(7-9)18-15(19)11-5-6-12(16)13(17)8-11/h3-8,18H,1-2H3
charge 0 multiplicity 1
32 atoms
Cl 4.085827 -1.743614 2.244082
Cl 6.141836 -0.982419 -0.210139
O  -0.155389 1.343613 -1.496206
N  -0.736659 -0.346787 0.036577
C  -2.153011 -0.20172 0.13769
C  -2.844439 -1.142816 0.967232
C  -4.264734 0.940989 -0.405661
C  -2.859484 0.82313 -0.539367
C  -4.243927 -1.008139 1.085463
C  -4.952065 0.014589 0.413897
C  -2.106262 -2.250664 1.702144
C  0.171032 0.406146 -0.703636
C  1.62166 0.020439 -0.52423
C  -5.005562 2.047518 -1.136751
C  2.123238 -0.623371 0.635277
C  2.521439 0.371231 -1.562415
C  3.494289 -0.931513 0.736655
C  3.889672 0.05996 -1.46073
C  4.379335 -0.597995 -0.311111
H  -2.302089 1.518175 -1.171215
H  -4.790501 -1.718828 1.716784
H  -0.349539 -1.142881 0.545795
H  -6.039564 0.089466 0.527884
H  -1.570576 -2.933318 1.011206
H  -1.367892 -1.855506 2.430003
H  -2.814706 -2.871435 2.27465
H  -4.652521 3.045336 -0.815536
H  -4.84302 1.984527 -2.22885
H  -6.092314 1.997159 -0.951888
H  1.481171 -0.852734 1.492327
H  2.127093 0.89752 -2.436432
H  4.584964 0.322147 -2.2631
