program: Gaussian 09
title: 000295137
version: EM64L-G09RevD.01
frameworkgroup: C1[X(C14H13ClN2O)]
method: RPBEPBE
basis: SDD
operation: Freq
keyword: #p
keyword: freq=noraman
keyword: PBEPBE/SDD
title: #p freq=noraman PBEPBE/SDD
converged: NO YES NO NO
title: Mulliken charges:
elementType: Cl O N N C C C C C C C C C C C C C C H H H H H H H H H H H H H
charge: -0.065528 -0.280125 -0.516772 -0.505533 0.332903 0.270665 -0.267462 -0.374765 -0.849549 0.480853 -0.109874 -0.270362 0.272329 -0.450532 -0.332517 -0.197387 -0.214395 -0.257348 0.331546 0.315199 0.233172 0.227992 0.251822 0.228014 0.256151 0.288563 0.212466 0.307461 0.226105 0.227319 0.229588
chargesum: 0.00000
title: Mulliken charges with hydrogens summed into heavy atoms:
elementType: Cl O N N C C C C C C C C C C C C C C
charge: -0.065528 -0.280125 -0.201572 -0.216971 0.332903 0.270665 0.064084 -0.141593 -0.141721 0.480853 -0.109874 -0.014211 0.272329 -0.238067 -0.025056 0.028718 0.012925 -0.027759
polarizability: 3.03325644e+02 6.16311125e-01 2.01434905e+02 -7.79468101e-03 1.99525389e-02 7.27062304e+01
1716.lowfreq: -8.6250 -4.2584 -0.9922 -0.0022 -0.0020 0.0009 17.0784 33.5467 57.1969
frequency: 17.0582 33.5220 57.1927 70.9008 79.0028 109.5024 152.1492 192.5779 194.1260 211.8226 227.9751 276.0077 305.5133 315.0807 354.3959 360.2898 406.8474 421.1329 441.5788 455.1193 515.9745 517.2881 581.2328 610.9979 612.7043 621.5698 633.8028 695.6249 698.8465 717.4442 740.9195 765.7884 788.7325 801.9912 829.1174 839.3803 904.2089 914.0636 919.5676 936.0954 970.5344 981.2390 983.4815 998.8957 999.5710 1029.0083 1041.6887 1078.7974 1090.7526 1130.3380 1172.5086 1178.1887 1184.8982 1189.5988 1253.5063 1269.7284 1280.2566 1320.0841 1370.9910 1384.3640 1394.1730 1413.9020 1428.7991 1452.9768 1480.9719 1481.8845 1486.7786 1509.0463 1519.7476 1589.6592 1602.2570 1612.4440 1616.3387 1654.3179 2950.0148 3017.4004 3088.9812 3102.7883 3132.8352 3134.5519 3144.5985 3166.1593 3179.5359 3197.6701 3199.1168 3520.3196 3540.9909
redmass: 4.0724 5.9947 7.0437 5.8266 4.1462 4.2111 7.8790 1.1995 4.7375 2.3660 3.5108 6.2261 5.1909 3.6002 7.4739 9.7496 2.9336 1.6940 3.6524 2.5931 6.4444 2.6575 3.6159 6.3592 1.2948 6.2874 7.0208 1.9883 11.5521 3.6341 6.1540 1.6875 5.7934 1.2922 5.8120 1.2725 5.5797 1.4232 1.3542 1.3465 1.3497 1.9143 3.4684 6.3472 1.3043 2.1268 1.5106 2.1365 1.5715 1.6431 1.0555 2.6185 1.9522 1.1348 2.1934 1.3832 2.4638 1.4740 5.0201 6.1785 1.3191 3.6604 2.3799 1.8942 1.6551 1.0444 1.9944 1.8631 2.1866 5.7328 5.4005 6.1287 5.8993 3.8339 1.0403 1.0979 1.0940 1.0889 1.0866 1.0900 1.0932 1.0999 1.0955 1.0930 1.0948 1.0762 1.0751
irintensity: 0.3643 0.5643 0.0312 9.0468 0.3880 0.0540 2.1190 0.9123 1.3175 0.1582 2.4522 4.7668 5.4339 2.4200 5.3389 4.8323 0.0087 0.8447 0.3647 14.3379 18.0239 27.9543 0.2297 4.5027 116.4236 7.8282 4.0178 48.7189 21.6822 0.5013 3.1657 97.2638 0.3318 43.1115 24.5783 0.1151 32.2139 6.7339 36.5769 2.0879 0.2237 11.0033 12.5345 14.7204 3.1430 6.9159 6.2711 9.1088 10.3797 6.0569 0.7302 305.8268 31.3155 0.3221 206.6026 5.5997 5.8768 78.6529 56.3800 154.4607 9.3662 144.9792 120.1538 134.6141 357.5569 15.0357 27.3384 804.6844 63.7890 136.6885 32.8127 81.1329 40.4227 90.0518 37.1577 24.1274 17.2528 19.3167 0.1145 16.5303 29.5648 27.3115 2.8334 24.2150 5.9752 10.2464 25.8199
temp: 298.150 k
press: 1.00000 atm
elementType: 17 8 7 7 6 6 6 6 6 6 6 6 6 6 6 6 6 6 1 1 1 1 1 1 1 1 1 1 1 1 1
symmnumber: 1
zpe: 627165.2 jmol-1
zpe.correction: 0.238875 hartree
zpe.thermalcorrener: 0.255274 hartree
zpe.thermalcorrenthalpy: 0.256218 hartree
zpe.thermalcorrgfe: 0.192700 hartree
zpe.sumelectzpe: -1184.833527 hartree
zpe.sumelectthermal: -1184.817127 hartree
zpe.sumelectthermalent: -1184.816183 hartree
zpe.sumelectthermalfe: -1184.879701 hartree
dipole: -1.6740 6.4741 0.0007
dipole: 6.6870
quadrupole: -104.0919 -99.9895 -119.2831
quadrupole: 7.0147 0.0008 0.0012
quadrupole: 3.6963 7.7987 -11.4949 7.0147 0.0008 0.0012
hfenergy: -1185.0724013 hartree
pointgroup: C01 [X(C14H13Cl1N2O1)]
dipole: -0.45914 -2.5905031 -0.0002777 debye
polarizability: 302.8084883|7.266759|201.9520613|0.0062243|0.0204968|72.7062304 unknown
InChI: InChI=1S/C14H13ClN2O/c1-10-7-8-11(15)9-13(10)17-14(18)16-12-5-3-2-4-6-12/h2-9,16-17H,1H3
charge 0 multiplicity 1
31 atoms
Cl 4.338971 3.029252 0.000702
O  -0.386636 1.280138 0.001308
N  0.726059 -0.804515 0.001257
N  -1.604174 -0.73969 0.001231
C  2.088851 -0.40173 0.000762
C  3.077942 -1.43913 0.00007
C  2.475945 0.964697 0.00095
C  4.439786 -1.065764 -0.000398
C  2.680634 -2.906213 -0.000146
C  -2.946592 -0.262011 0.000687
C  3.845783 1.270708 0.000453
C  4.84964 0.286948 -0.000218
C  -0.420245 0.016331 0.001773
C  -3.977196 -1.241982 0.000062
C  -3.289489 1.116603 0.000754
C  -5.331433 -0.853464 -0.000484
C  -4.651506 1.487578 0.000197
C  -5.67934 0.517418 -0.000423
H  1.71318 1.744129 0.001465
H  0.582808 -1.815542 0.001089
H  5.203859 -1.851427 -0.000931
H  2.088668 -3.181656 -0.89721
H  3.57503 -3.550097 -0.000884
H  2.08974 -3.182203 0.897456
H  5.907925 0.559385 -0.000588
H  -1.520228 -1.758666 0.001084
H  -3.717671 -2.309553 0.000001
H  -2.497365 1.866604 0.001238
H  -6.112801 -1.621361 -0.000963
H  -4.9076 2.553059 0.000255
H  -6.731144 0.821753 -0.00085
