program: Gaussian 09
title: 000027385
version: EM64L-G09RevD.01
frameworkgroup: C1[X(C12H16FNO3)]
method: RPBEPBE
basis: SDD
operation: Freq
keyword: #p
keyword: freq=noraman
keyword: PBEPBE/SDD
title: #p freq=noraman PBEPBE/SDD
converged: YES YES NO NO
title: Mulliken charges:
elementType: F O O O N C C C C C C C C C C C C H H H H H H H H H H H H H H H H
charge: -0.191899 -0.241268 -0.330685 -0.377602 -0.312952 -0.380165 -0.342369 -0.294626 0.517076 0.203820 -0.686040 -0.641511 -0.572625 -0.382721 0.194179 -0.307432 0.302583 0.214335 0.213792 0.193411 0.194266 0.206235 0.206376 0.213272 0.213532 0.218219 0.258262 0.210846 0.254437 0.275449 0.256753 0.335924 0.379128
chargesum: 0.00000
title: Mulliken charges with hydrogens summed into heavy atoms:
elementType: F O O O N C C C C C C C C C C C C
charge: -0.191899 -0.241268 -0.330685 0.001526 0.022973 0.047962 0.045307 0.117985 0.517076 0.203820 -0.041017 -0.172403 -0.318188 -0.107272 0.194179 -0.050679 0.302583
polarizability: 2.17905368e+02 -1.58227222e+00 1.41679426e+02 -2.15571746e+00 9.40242158e+00 1.02190580e+02
1716.lowfreq: -6.8457 -3.3025 -0.0006 0.0001 0.0007 8.9530 20.9106 27.0788 34.5535
frequency: 20.5294 26.9722 34.5368 52.6124 60.6838 80.1783 102.9093 141.8763 149.7838 180.1460 197.6161 210.4450 224.9792 237.4504 246.9381 265.7320 337.4046 346.7286 371.4562 384.8597 415.8609 450.2662 486.5556 497.6190 518.8195 565.9289 592.3480 624.4609 702.9532 715.6426 743.5245 760.8221 771.8641 808.5318 825.2762 860.9851 898.1523 903.3510 918.0674 939.2383 953.5881 961.5555 963.5245 1012.6309 1040.7839 1082.1687 1102.6228 1124.2784 1141.3047 1143.1102 1162.4225 1210.7577 1213.2238 1246.2716 1258.9276 1273.3274 1276.5580 1280.4349 1286.0168 1295.1540 1346.4525 1357.7360 1375.1709 1388.6123 1392.9281 1429.0639 1448.6664 1469.8395 1472.8752 1476.0537 1480.8575 1490.5994 1496.7701 1505.0144 1570.5183 1582.2781 1628.4107 2948.0966 2966.8496 2976.5527 2993.8211 2998.2839 3006.7227 3011.0910 3053.0126 3061.9725 3075.8885 3077.0782 3148.9356 3151.0872 3170.6966 3240.8125 3617.0992
redmass: 5.4940 5.2791 5.8453 4.4585 1.6809 4.2680 3.8336 2.0716 5.4395 4.3854 6.7568 6.1624 1.1278 7.6437 5.0955 3.7072 5.2667 2.7498 2.5581 1.9220 3.4382 3.1604 1.3135 6.4676 2.5529 5.0842 4.4385 3.8350 5.9421 3.7238 1.0769 5.9654 3.6460 1.2822 1.3341 1.5834 2.4211 1.8158 4.5814 1.1635 1.4488 2.9241 6.6897 4.6885 3.4206 2.2365 2.6670 2.6415 1.2830 1.4328 1.4763 1.8196 1.3773 1.2600 2.9627 1.5719 1.5561 1.1874 1.0596 1.5288 1.4700 2.4551 1.8991 2.1168 1.3881 3.6693 1.1047 1.0881 1.0793 1.0429 1.1008 1.1290 1.9120 2.4413 4.0403 6.8703 7.2142 1.0551 1.0591 1.0363 1.0598 1.0595 1.1055 1.1019 1.1011 1.1041 1.1017 1.0995 1.0892 1.0920 1.0953 1.0633 1.0831
irintensity: 1.1812 3.2207 2.9301 1.5655 0.0887 3.6933 2.9651 2.9778 0.2894 2.0061 7.5212 1.2239 0.1049 2.4785 11.2301 13.3924 8.8662 39.9239 45.1874 30.8077 6.5536 2.9484 165.2309 1.4688 36.1258 2.5270 16.3315 13.6845 7.6779 0.6237 11.9176 16.3766 25.6158 9.9574 22.6767 26.0066 6.1676 24.2807 35.0028 0.8083 1.8012 22.2655 52.0343 94.7253 20.6932 19.4285 68.4557 4.9408 18.0840 1.8693 24.1557 52.9046 0.0148 15.1920 206.1891 1.1583 32.5488 0.3183 0.0760 7.4972 1.7280 212.0589 6.9351 33.3152 4.8594 7.8182 18.8155 8.3424 4.4928 13.0718 41.3907 38.4427 80.1897 153.8866 109.4859 6.1895 15.4561 24.9475 38.4509 34.9929 21.9310 33.4284 28.1551 3.8090 11.4846 9.9083 104.9529 49.0346 1.3547 6.2000 7.8302 26.0372 67.5363
temp: 298.150 k
press: 1.00000 atm
elementType: 9 8 8 8 7 6 6 6 6 6 6 6 6 6 6 6 6 1 1 1 1 1 1 1 1 1 1 1 1 1 1 1 1
symmnumber: 1
zpe: 688526.3 jmol-1
zpe.correction: 0.262246 hartree
zpe.thermalcorrener: 0.280439 hartree
zpe.thermalcorrenthalpy: 0.281383 hartree
zpe.thermalcorrgfe: 0.213229 hartree
zpe.sumelectzpe: -845.792327 hartree
zpe.sumelectthermal: -845.774134 hartree
zpe.sumelectthermalent: -845.773190 hartree
zpe.sumelectthermalfe: -845.841343 hartree
dipole: 0.9275 -0.0167 -0.5555
dipole: 1.0813
quadrupole: -92.8865 -104.1316 -102.6557
quadrupole: -22.4500 -0.9862 -0.7688
quadrupole: 7.0047 -4.2403 -2.7644 -22.4500 -0.9862 -0.7688
hfenergy: -846.0545725 hartree
pointgroup: C01 [X(C12H16F1N1O3)]
dipole: 0.3657748 -0.1147251 -0.1844463 debye
polarizability: 217.9416535|-0.2863238|138.2413122|-2.2420731|-14.5023636|105.5924075 unknown
InChI: InChI=1S/C12H16FNO3/c1-2-3-6-17-11-5-4-9(7-10(11)13)8-12(15)14-16/h4-5,7,14,16H,2-3,6,8H2,1H3
charge 0 multiplicity 1
33 atoms
F  0.785835 2.699044 -1.391985
O  2.381495 0.660852 -0.543568
O  -3.884872 -1.94574 0.334422
O  -5.480948 -0.45733 1.84162
N  -4.842747 0.091901 0.674933
C  4.675466 0.122906 -0.002362
C  5.688188 -0.930995 0.504037
C  3.254168 -0.436744 -0.071881
C  -1.805493 0.062029 -1.033374
C  1.021763 0.38748 -0.679006
C  7.126869 -0.375211 0.570136
C  -3.310303 -0.10602 -1.246489
C  -1.185928 1.309384 -1.298676
C  -0.999391 -1.014157 -0.591554
C  0.195388 1.452155 -1.122121
C  0.392639 -0.855524 -0.414489
C  -4.012447 -0.726911 -0.044207
H  4.681415 1.004564 0.666425
H  4.971675 0.480084 -1.006965
H  5.665491 -1.818127 -0.161549
H  5.382708 -1.28547 1.509668
H  3.192523 -1.287752 -0.782139
H  2.909246 -0.778546 0.926416
H  7.468801 -0.042062 -0.427493
H  7.184829 0.493807 1.251853
H  7.837295 -1.139418 0.934149
H  -3.501553 -0.783561 -2.10069
H  -3.767413 0.868446 -1.499294
H  -1.760734 2.174969 -1.645301
H  -1.46949 -1.978069 -0.370941
H  0.984576 -1.707426 -0.068737
H  -5.012847 1.091041 0.578537
H  -5.130504 -1.407999 1.812726
