program: Gaussian 09
title: 000295130
version: EM64L-G09RevD.01
frameworkgroup: C1[X(C15H15ClN2O2)]
method: RPBEPBE
basis: SDD
operation: Freq
keyword: #p
keyword: freq=noraman
keyword: PBEPBE/SDD
title: #p freq=noraman PBEPBE/SDD
converged: NO YES NO NO
title: Mulliken charges:
elementType: Cl O O N N C C C C C C C C C C C C C C C H H H H H H H H H H H H H H H
charge: -0.070225 -0.264604 -0.286702 -0.509461 -0.501806 0.501928 0.533419 0.483387 -0.471195 -0.346242 -0.244850 -0.396744 0.271052 -0.462476 -0.310957 -0.798800 0.321614 -0.327655 -0.352133 -0.537736 0.243483 0.310269 0.234201 0.290891 0.287144 0.211803 0.307932 0.243313 0.243313 0.223790 0.240568 0.250480 0.245755 0.218622 0.218622
chargesum: 0.00000
title: Mulliken charges with hydrogens summed into heavy atoms:
elementType: Cl O O N N C C C C C C C C C C C C C C C
charge: -0.070225 -0.264604 -0.286702 -0.218569 -0.214662 0.501928 0.533419 0.483387 -0.227712 -0.035973 -0.244850 -0.162543 0.271052 -0.250673 -0.003025 -0.088385 0.321614 -0.087087 -0.101653 0.145264
polarizability: 3.86151049e+02 3.69608413e+00 1.89637373e+02 -1.41238613e-02 -1.87931438e-02 8.46282028e+01
1716.lowfreq: -5.4480 -2.4606 -0.0021 -0.0017 -0.0009 6.8242 19.1938 20.8417 49.2516
frequency: 19.0534 20.6274 49.2429 52.6735 68.1585 95.9241 116.8252 139.5186 140.7919 160.0268 169.5288 186.3470 229.6937 236.0021 239.8152 285.1616 318.3618 355.2472 356.7007 391.9040 414.1012 423.9823 437.5170 447.4579 455.3988 495.9254 525.6037 571.9296 582.5571 611.9343 627.9416 672.0142 693.0388 698.6955 719.5243 720.0746 767.5915 780.2521 795.5115 835.0821 841.2236 850.1342 855.8351 893.3301 912.0129 980.2257 984.3280 987.6269 995.7054 997.2689 1013.0651 1026.7048 1045.7576 1110.6108 1119.9912 1155.9165 1156.4895 1175.5768 1184.5411 1215.7391 1221.9024 1257.3750 1272.5947 1297.3844 1305.5615 1347.7588 1370.7547 1399.7745 1404.7582 1423.7675 1435.2137 1463.2092 1464.8585 1465.7527 1472.5873 1491.9238 1498.5314 1509.1326 1518.0572 1580.9760 1594.7382 1626.6479 1632.0576 1649.6553 2954.8537 2982.9493 3040.5682 3061.7007 3092.9108 3107.6792 3123.5991 3134.2933 3137.0035 3161.4769 3162.8388 3198.7945 3202.1398 3520.4208 3532.1544
redmass: 4.1076 5.5735 6.3027 4.4520 7.8767 3.4936 1.2406 8.1140 2.1974 3.3273 4.9826 4.6903 5.6474 1.1647 3.9652 6.1152 2.8660 6.3748 3.7795 7.1677 3.0610 6.0758 2.7306 3.8165 1.9297 4.9673 2.3148 5.9543 3.2700 1.3109 7.0725 7.4812 9.4576 2.9417 3.6183 5.3250 5.7371 6.5002 1.3993 6.1317 1.2988 1.4841 1.5982 5.8935 1.3896 1.3140 1.3053 8.1274 1.5347 3.1411 4.4887 2.8932 1.5053 1.2611 1.3269 1.3006 1.3349 2.0544 1.4755 1.7260 2.3064 2.5640 1.8796 1.8486 1.5389 3.9772 6.0794 1.5874 2.5800 4.1298 1.1704 1.0450 1.2605 1.0504 1.0776 2.1613 2.2859 2.1471 2.6451 4.4440 5.6633 6.9675 6.4408 3.7794 1.0333 1.0368 1.1037 1.0975 1.0995 1.0895 1.0989 1.0917 1.0913 1.0920 1.0922 1.0951 1.0943 1.0765 1.0755
irintensity: 3.1675 0.0603 0.3006 0.0026 7.8514 9.2158 0.7176 4.0768 0.2640 1.0139 0.3151 2.3304 1.0502 0.0009 12.9535 4.2211 1.7128 0.5084 2.1499 0.3976 0.0014 19.2965 6.2039 0.6628 0.6852 26.1550 33.8303 1.9614 33.9417 108.3899 0.4547 5.7629 26.0040 1.4467 0.0412 27.2861 1.7982 3.2949 44.7389 6.3126 0.4848 45.5317 97.5896 8.9401 1.8946 3.8279 3.4920 58.1921 41.8099 17.5860 15.4240 36.5160 7.9054 0.2002 20.4922 4.5723 0.3840 522.2868 19.4635 111.1616 203.2137 26.3094 21.7243 47.8182 1.4573 138.5906 283.3869 29.5861 5.0621 9.8513 26.1400 14.0427 55.2486 13.3966 167.3892 110.0410 628.8272 751.6370 70.3713 128.6391 46.2607 89.8577 2.9268 115.7438 86.7481 33.4412 53.5417 16.1373 16.5888 27.4151 24.6669 17.4354 5.9314 10.4193 8.5053 8.5633 8.2069 8.3695 14.8771
temp: 298.150 k
press: 1.00000 atm
elementType: 17 8 8 7 7 6 6 6 6 6 6 6 6 6 6 6 6 6 6 6 1 1 1 1 1 1 1 1 1 1 1 1 1 1 1
symmnumber: 1
zpe: 708955.9 jmol-1
zpe.correction: 0.270027 hartree
zpe.thermalcorrener: 0.289337 hartree
zpe.thermalcorrenthalpy: 0.290282 hartree
zpe.thermalcorrgfe: 0.219977 hartree
zpe.sumelectzpe: -1299.185029 hartree
zpe.sumelectthermal: -1299.165719 hartree
zpe.sumelectthermalent: -1299.164774 hartree
zpe.sumelectthermalfe: -1299.235079 hartree
dipole: -2.2212 -4.0212 0.0013
dipole: 4.5939
quadrupole: -109.5850 -113.4934 -130.6800
quadrupole: 22.3351 -0.0050 -0.0049
quadrupole: 8.3345 4.4261 -12.7606 22.3351 -0.0050 -0.0049
hfenergy: -1299.4550561 hartree
pointgroup: C01 [X(C15H15Cl1N2O2)]
dipole: 0.9149344 -1.5586705 -0.0005032 debye
polarizability: 386.2099757|1.4414268|189.578447|-0.01461|0.0184177|84.6282028 unknown
InChI: InChI=1S/C15H15ClN2O2/c1-10-3-4-12(9-14(10)16)18-15(19)17-11-5-7-13(20-2)8-6-11/h3-9,17-18H,1-2H3
charge 0 multiplicity 1
35 atoms
Cl -6.287105 -1.989746 0.000058
O  6.551073 0.644069 -0.000149
O  -0.021362 1.304504 -0.000025
N  -1.265535 -0.701095 -0.000387
N  1.064831 -0.790242 -0.000482
C  -2.593268 -0.194971 -0.00017
C  -5.348021 0.658223 0.000201
C  2.436884 -0.398096 -0.000401
C  -3.64661 -1.149054 -0.000139
C  -2.915399 1.188008 -0.000011
C  -4.978239 -0.707321 0.00004
C  -4.269249 1.580306 0.000172
C  -0.065717 0.039469 -0.000353
C  3.409702 -1.428664 -0.000718
C  2.867724 0.95809 -0.00001
C  -6.791243 1.116838 0.000381
C  5.210496 0.219728 -0.000258
C  4.789345 -1.132399 -0.000652
C  4.241554 1.25262 0.000057
C  7.584435 -0.392155 -0.000479
H  -3.432199 -2.223885 -0.000249
H  -2.112178 1.925471 -0.000019
H  -4.504997 2.650885 0.000295
H  -1.196879 -1.720853 -0.000523
H  0.915667 -1.801453 -0.00071
H  3.093165 -2.480486 -0.001031
H  2.124987 1.756946 0.000214
H  -7.33385 0.740693 -0.88641
H  -7.333744 0.740342 0.887086
H  -6.850342 2.218071 0.000599
H  5.510395 -1.954799 -0.000914
H  4.586168 2.291251 0.000357
H  8.539724 0.152969 -0.000322
H  7.519183 -1.028053 -0.905476
H  7.519206 -1.02861 0.904128
