program: Gaussian 09
title: 000295128
version: EM64L-G09RevD.01
frameworkgroup: C1[X(C14H10Cl3NO)]
method: RPBEPBE
basis: SDD
operation: Freq
keyword: #p
keyword: freq=noraman
keyword: PBEPBE/SDD
title: #p freq=noraman PBEPBE/SDD
converged: YES YES NO NO
title: Mulliken charges:
elementType: Cl Cl Cl O N C C C C C C C C C C C C C C H H H H H H H H H H
charge: -0.061983 -0.063398 -0.023816 -0.274635 -0.463866 0.333863 0.266451 0.316978 -0.273407 -0.374111 0.177329 -0.839184 -0.113214 -0.265333 -0.238576 -0.289596 -0.214976 -0.229631 -0.094818 0.329791 0.336704 0.235609 0.236663 0.244558 0.234542 0.257427 0.297352 0.285316 0.267961
chargesum: 0.00000
title: Mulliken charges with hydrogens summed into heavy atoms:
elementType: Cl Cl Cl O N C C C C C C C C C C C C C C
charge: -0.061983 -0.063398 -0.023816 -0.274635 -0.134075 0.333863 0.266451 0.316978 0.063298 -0.138503 0.177329 -0.123420 -0.113214 -0.007906 -0.238576 0.007755 0.070340 0.038330 -0.094818
polarizability: 3.40323700e+02 -1.03130868e+01 2.10728604e+02 1.47958193e+00 -3.65282226e-02 7.52588815e+01
1716.lowfreq: -4.5397 -1.5996 -0.0020 -0.0017 -0.0016 1.9286 7.9860 24.0335 66.3173
frequency: 7.7982 24.0311 66.3169 74.9636 91.9636 110.4029 136.1046 158.3459 183.8990 191.3018 201.2071 225.0646 266.5129 283.8235 294.2985 329.0823 355.0888 360.0495 374.7527 432.4774 442.9770 451.1296 453.5869 530.8272 540.7712 577.3115 584.6620 630.5387 652.0959 657.6195 677.4828 725.0969 730.2268 745.3734 773.0547 808.3297 850.5059 860.6823 863.8133 891.3963 929.1010 942.5042 988.2909 995.1559 1005.9254 1043.8594 1077.0564 1088.9443 1100.3956 1132.4313 1138.3107 1188.5749 1220.2451 1250.0973 1267.2351 1274.9104 1342.0657 1371.4946 1383.8027 1399.0098 1407.2843 1444.4294 1461.7231 1478.6301 1481.0413 1520.9328 1546.4480 1584.1546 1586.1460 1604.8634 1610.6001 2963.9732 3035.8465 3090.8947 3137.2860 3157.3482 3177.5881 3181.9338 3185.5306 3202.9688 3476.6672
redmass: 8.3291 11.5827 9.9471 6.5962 5.6631 4.4963 14.0250 6.0952 7.7835 1.1034 10.5561 5.0227 6.1765 5.6879 6.0914 4.2315 12.6003 10.8167 8.5563 6.5428 3.3746 3.7917 3.0241 6.7114 7.2805 4.0722 6.2251 6.7014 7.1128 3.8214 1.4254 3.6669 5.2771 4.4219 5.9925 1.2914 1.4374 6.3094 1.4187 6.5312 1.3432 1.3547 1.5341 1.3499 5.1971 1.5218 2.3654 3.5897 2.2911 1.4779 1.5433 2.2566 2.5405 1.3796 2.3351 1.5299 3.7784 6.1150 6.0260 1.4579 2.7699 2.4096 2.0644 1.1992 1.1849 2.2015 7.3892 9.0643 6.0324 3.9442 4.9821 1.0395 1.0977 1.0958 1.0898 1.0892 1.0958 1.0956 1.0941 1.0928 1.0769
irintensity: 1.4784 0.2439 0.7793 5.7002 0.3915 0.0739 1.2087 0.0746 0.5192 0.7217 0.4033 0.6664 2.8576 0.6004 1.6116 1.8330 3.1497 6.7799 5.3279 30.8323 3.7962 12.3088 17.7082 6.5401 6.3639 0.6160 13.4157 15.5793 2.9466 6.0106 66.2806 6.2805 16.5258 20.1209 40.2131 41.7454 30.6094 18.4965 20.2021 72.0744 26.7699 4.2402 19.8156 2.6651 50.1698 6.7578 2.7916 13.6401 27.8263 35.1903 14.6482 1.5729 66.9703 27.2216 52.6201 3.0570 5.1299 27.4673 37.9446 9.3777 74.1579 135.5232 55.8862 57.4641 68.3750 429.3090 3.4233 146.8208 171.0668 47.8642 8.8051 23.9517 17.7715 22.1300 15.1046 5.8155 3.7562 2.9488 0.9794 19.4103 109.1886
temp: 298.150 k
press: 1.00000 atm
elementType: 17 17 17 8 7 6 6 6 6 6 6 6 6 6 6 6 6 6 6 1 1 1 1 1 1 1 1 1 1
symmnumber: 1
zpe: 532880.5 jmol-1
zpe.correction: 0.202963 hartree
zpe.thermalcorrener: 0.220525 hartree
zpe.thermalcorrenthalpy: 0.221469 hartree
zpe.thermalcorrgfe: 0.154360 hartree
zpe.sumelectzpe: -2048.332332 hartree
zpe.sumelectthermal: -2048.314771 hartree
zpe.sumelectthermalent: -2048.313827 hartree
zpe.sumelectthermalfe: -2048.380936 hartree
dipole: 1.9969 3.8498 0.5758
dipole: 4.3750
quadrupole: -134.9995 -124.9941 -134.9858
quadrupole: -14.7791 -0.8034 -0.2890
quadrupole: -3.3397 6.6657 -3.3260 -14.7791 -0.8034 -0.2890
hfenergy: -2048.5352958 hartree
pointgroup: C01 [X(C14H10Cl3N1O1)]
dipole: -0.6363975 -1.1328162 -1.1288899 debye
polarizability: 340.9894755|5.8637579|123.2880767|-1.9084201|64.4323022|162.0336334 unknown
InChI: InChI=1S/C14H10Cl3NO/c1-8-2-3-10(16)7-13(8)18-14(19)11-5-4-9(15)6-12(11)17/h2-7,18H,1H3
charge 0 multiplicity 1
29 atoms
Cl 4.955796 1.481668 2.150644
Cl -1.607535 -1.494799 -2.03523
Cl -6.461912 -0.434488 0.278388
O  0.006953 0.990511 1.640264
N  0.597788 -0.472654 -0.08436
C  2.020457 -0.409198 -0.008414
C  2.763639 -1.221723 -0.926997
C  -1.812035 -0.05329 0.453442
C  2.693821 0.416129 0.932734
C  4.174061 -1.176015 -0.867501
C  -0.327246 0.197719 0.703923
C  2.071556 -2.112874 -1.94391
C  4.09746 0.418126 0.940386
C  4.86478 -0.36208 0.058751
C  -2.481609 -0.720491 -0.605989
C  -2.65628 0.499835 1.462344
C  -3.884095 -0.842007 -0.676462
C  -4.056485 0.397214 1.434395
C  -4.656579 -0.280329 0.355466
H  0.222689 -1.082565 -0.816802
H  2.116339 1.027254 1.626471
H  4.75219 -1.793128 -1.564283
H  1.454881 -1.531369 -2.65726
H  2.813921 -2.670595 -2.537544
H  1.409909 -2.861786 -1.46529
H  5.957185 -0.339665 0.089223
H  -2.147775 1.029734 2.274046
H  -4.355736 -1.359533 -1.514834
H  -4.665839 0.833402 2.229898
