program: Gaussian 09
title: 000295125
version: EM64L-G09RevD.01
frameworkgroup: C1[X(C14H10Cl3NO)]
method: RPBEPBE
basis: SDD
operation: Freq
keyword: #p
keyword: freq=noraman
keyword: PBEPBE/SDD
title: #p freq=noraman PBEPBE/SDD
converged: YES YES NO NO
title: Mulliken charges:
elementType: Cl Cl Cl O N C C C C C C C C C C C C C C H H H H H H H H H H
charge: -0.062400 -0.061011 -0.024633 -0.279079 -0.455616 0.502903 0.536647 0.316463 -0.468343 -0.353912 -0.247268 -0.394992 0.170232 -0.238319 -0.287821 -0.798177 -0.206421 -0.229067 -0.094421 0.255184 0.313333 0.305600 0.236374 0.296232 0.245441 0.245537 0.224787 0.285408 0.267340
chargesum: 0.00000
title: Mulliken charges with hydrogens summed into heavy atoms:
elementType: Cl Cl Cl O N C C C C C C C C C C C C C C
charge: -0.062400 -0.061011 -0.024633 -0.279079 -0.150016 0.502903 0.536647 0.316463 -0.213159 -0.040579 -0.247268 -0.158618 0.170232 -0.238319 0.008412 -0.082412 0.078986 0.038273 -0.094421
polarizability: 3.67813025e+02 9.24063814e+00 1.97948191e+02 -4.72315392e-02 1.32235539e-02 7.44093111e+01
1716.lowfreq: -4.8978 -0.9378 -0.0025 -0.0012 -0.0009 3.8286 11.2575 28.5129 56.3149
frequency: 8.8060 28.3481 56.3093 59.5258 84.5681 113.2579 145.0094 159.0848 162.6164 179.2395 195.5119 201.1694 234.4720 280.3285 282.3108 342.6784 348.3632 372.1301 392.0760 432.0528 438.5480 447.2278 448.3442 534.8257 538.4410 548.9737 582.3465 650.5982 654.9711 674.5683 698.1609 702.5394 737.0608 744.6985 768.0546 844.6702 851.3276 864.8411 867.2086 871.8918 873.7294 983.3473 996.5549 998.3572 1006.5684 1027.1987 1046.5200 1089.3237 1108.4411 1130.9529 1154.4700 1215.6280 1226.6241 1250.1961 1260.9342 1294.6030 1341.9615 1354.8997 1383.2562 1400.3682 1405.2176 1445.6360 1461.5401 1467.7584 1492.6830 1523.7360 1545.3464 1581.6745 1586.2263 1606.5922 1622.0789 2984.2441 3062.6908 3095.4766 3138.4210 3145.2415 3154.7064 3180.5828 3184.8110 3206.3152 3460.2324
redmass: 14.7430 5.8617 11.6866 7.0991 6.9754 1.0695 3.4852 6.0831 16.0884 7.1159 5.4816 17.6622 5.7375 6.7286 6.1871 15.1281 4.1750 8.8630 7.5581 7.3580 3.1106 4.1016 3.3041 6.1988 7.8982 6.6398 3.9280 7.4708 4.0880 7.8763 1.3139 2.5610 7.1646 4.5124 5.5892 1.2679 1.4280 1.4141 1.6227 7.9993 6.0467 1.3223 1.4929 1.3337 4.8771 3.0850 1.5152 3.4363 2.6572 1.4354 1.2726 1.8743 2.6987 1.4328 2.1586 1.8968 3.7841 4.2494 5.9445 1.8473 2.0938 2.4545 1.0451 1.1805 2.9412 2.4540 8.5025 7.9849 5.2420 2.9630 6.9072 1.0370 1.0972 1.0995 1.0908 1.0926 1.0892 1.0957 1.0941 1.0943 1.0772
irintensity: 0.3021 0.2254 0.0574 4.2397 4.8481 0.6377 0.2274 0.0805 1.2272 5.7864 2.7969 1.2490 1.4371 1.1566 0.1423 0.5582 1.1517 6.4743 0.2475 48.2747 0.6270 3.8625 13.3443 0.2508 13.3370 2.7187 17.7350 3.5915 7.8950 7.0490 37.5335 19.7435 46.8193 15.2694 22.1577 13.2807 30.7995 19.2761 64.6979 24.7968 31.7591 5.3016 30.9947 2.2464 30.8809 45.8573 8.4988 29.6689 16.2918 46.1245 9.8479 4.2858 49.9209 36.6012 8.5479 22.6763 4.4336 93.7163 41.8857 35.6023 4.9789 80.4203 14.4426 13.8074 138.5741 366.7893 2.1009 237.1770 178.0808 48.0623 9.0894 27.8211 14.4283 16.6281 18.2480 2.0472 6.4866 3.2816 1.0659 7.0483 143.4854
temp: 298.150 k
press: 1.00000 atm
elementType: 17 17 17 8 7 6 6 6 6 6 6 6 6 6 6 6 6 6 6 1 1 1 1 1 1 1 1 1 1
symmnumber: 1
zpe: 532591.2 jmol-1
zpe.correction: 0.202853 hartree
zpe.thermalcorrener: 0.220581 hartree
zpe.thermalcorrenthalpy: 0.221525 hartree
zpe.thermalcorrgfe: 0.153938 hartree
zpe.sumelectzpe: -2048.334016 hartree
zpe.sumelectthermal: -2048.316288 hartree
zpe.sumelectthermalent: -2048.315344 hartree
zpe.sumelectthermalfe: -2048.382932 hartree
dipole: -0.6986 0.0886 0.0016
dipole: 0.7042
quadrupole: -125.5197 -129.3237 -135.0851
quadrupole: -6.0341 -0.0340 0.0108
quadrupole: 4.4565 0.6525 -5.1090 -6.0341 -0.0340 0.0108
hfenergy: -2048.5368691 hartree
pointgroup: C01 [X(C14H10Cl3N1O1)]
dipole: -0.2751025 -0.0297323 -0.0135877 debye
polarizability: 364.271839|19.4348299|87.6020795|-24.1800179|34.8493566|188.296609 unknown
InChI: InChI=1S/C14H10Cl3NO/c1-8-2-4-10(7-12(8)16)18-14(19)11-5-3-9(15)6-13(11)17/h2-7,18H,1H3
charge 0 multiplicity 1
29 atoms
Cl 4.944995 -0.477471 -2.595724
Cl -1.64072 -1.032256 -2.35625
Cl -6.659286 -0.787436 -0.169419
O  -0.357591 0.498887 1.944757
N  0.373307 -0.124202 -0.182867
C  1.778256 0.0546 -0.036107
C  4.640946 0.354875 0.069866
C  -2.062434 -0.174763 0.371662
C  2.577275 -0.238488 -1.174958
C  2.407592 0.497938 1.157092
C  3.968939 -0.084198 -1.09677
C  3.810196 0.637486 1.185149
C  -0.611966 0.091406 0.766578
C  -2.631018 -0.629475 -0.848272
C  -2.990635 0.083411 1.4239
C  6.144304 0.516572 0.134862
C  -4.016126 -0.819606 -1.028046
C  -4.377099 -0.092241 1.287589
C  -4.87525 -0.545926 0.051066
H  2.118724 -0.581975 -2.108438
H  1.799102 0.723403 2.033071
H  0.06768 -0.452621 -1.104759
H  4.286354 0.980334 2.110915
H  -2.556816 0.433746 2.366128
H  6.661058 -0.435273 -0.08661
H  6.502311 1.250915 -0.610182
H  6.458317 0.857383 1.135355
H  -4.409088 -1.171569 -1.984576
H  -5.053129 0.117845 2.120186
