program: Gaussian 09
title: 000295110
version: EM64L-G09RevD.01
frameworkgroup: C1[X(C16H15NO3)]
method: RPBEPBE
basis: SDD
operation: Freq
keyword: #p
keyword: freq=noraman
keyword: PBEPBE/SDD
title: #p freq=noraman PBEPBE/SDD
converged: YES YES NO NO
title: Mulliken charges:
elementType: O O O N C C C C C C C C C C C C C C C C H H H H H H H H H H H H H H H
charge: -0.281624 -0.422348 -0.296612 -0.465003 0.283433 0.281673 0.473063 -0.539486 -0.328536 -0.449439 0.100094 0.117867 -0.838714 0.151388 -0.816258 -0.322493 -0.313294 -0.227039 -0.226788 0.131392 0.229491 0.310064 0.393769 0.229240 0.228514 0.227824 0.254049 0.226658 0.228271 0.224959 0.288782 0.274698 0.240372 0.240989 0.391046
chargesum: 0.00000
title: Mulliken charges with hydrogens summed into heavy atoms:
elementType: O O O N C C C C C C C C C C C C C C C C
charge: -0.281624 -0.031303 -0.296612 -0.071234 0.283433 0.281673 0.473063 -0.309995 -0.018472 -0.220200 0.100094 0.117867 -0.128326 0.151388 -0.136370 -0.033711 -0.038596 0.013333 0.014201 0.131392
polarizability: 3.44967906e+02 -1.40020232e+01 2.02092573e+02 5.98991450e+00 2.98552908e+00 9.63015014e+01
1716.lowfreq: -6.8865 -4.9534 0.0006 0.0007 0.0008 2.7500 15.7630 21.9097 31.1420
frequency: 15.0366 21.8054 31.0904 62.1509 78.6085 87.6142 113.2172 154.5234 177.2460 188.2207 202.9482 216.4260 233.4606 257.2696 285.8390 326.0583 366.5113 390.4747 399.9456 425.5510 445.0606 457.3903 462.9025 506.6899 544.0332 560.3314 567.1342 598.4279 612.5302 643.0321 679.3681 701.9734 712.0605 732.6274 752.8099 778.2900 791.0874 797.1179 831.0355 844.3615 885.5397 888.6265 908.8074 929.9844 981.7644 983.8815 984.6524 1008.3491 1016.1299 1021.7418 1042.4287 1044.6665 1048.4062 1082.9512 1114.7926 1140.3341 1158.4352 1171.1971 1182.6992 1224.6565 1238.8900 1274.1544 1289.1374 1293.6577 1325.3321 1368.4972 1376.5322 1395.4274 1405.4176 1415.0423 1416.1776 1465.8044 1469.9766 1472.2061 1475.2588 1477.9702 1498.1065 1536.5987 1562.0363 1575.7220 1594.4761 1606.1318 1624.8097 1637.2089 2972.6694 2975.2686 3048.9665 3052.9789 3082.4162 3089.1248 3110.2649 3127.9260 3140.1234 3158.6371 3175.1201 3184.3907 3199.0922 3278.6302 3525.7359
redmass: 1.0527 4.2276 5.6877 8.7256 4.7100 5.1959 4.4962 5.2202 1.7313 4.0402 2.6232 2.2666 5.2348 5.1264 2.6558 6.3239 4.5816 5.3730 7.8391 4.2088 3.2834 3.0774 4.2214 5.8291 5.1880 4.7242 3.0868 1.2753 4.8074 5.4551 4.7345 3.3240 5.4379 3.3811 5.5024 3.6578 1.6245 4.7778 1.6656 1.3477 1.4074 2.0461 1.4549 3.3141 1.5127 1.3456 1.3782 1.3720 5.4494 1.4972 1.5232 3.5272 1.5705 2.8688 2.0699 1.7982 1.8557 1.5508 1.0711 2.5220 2.1972 1.6677 3.5446 1.4563 2.8451 6.0356 9.3324 1.2537 1.3815 2.4648 2.0540 2.0235 1.0467 1.7853 1.1384 1.0531 1.7880 3.2181 4.9090 5.8516 4.8160 5.8557 6.3362 2.3740 1.0373 1.0390 1.0975 1.0956 1.0984 1.0983 1.0911 1.0912 1.0869 1.0923 1.0942 1.0976 1.0937 1.0825 1.0641
irintensity: 0.4771 0.1101 2.5506 0.9868 0.7163 1.9890 1.8511 0.5554 2.7131 4.2340 0.7445 1.3690 1.4328 0.5861 0.9858 9.4108 2.1885 2.6110 12.7973 9.2654 5.7162 0.5998 7.7462 5.5866 1.6616 6.7888 11.2528 91.9420 51.8863 12.1729 0.1257 87.9511 1.2212 0.1606 6.6347 15.4129 53.5113 2.7790 68.0953 52.9255 3.1712 47.5966 0.3574 10.6322 12.3723 0.9404 12.2143 2.4760 215.5256 3.7267 0.8078 7.9658 19.1957 52.0355 47.3713 8.6838 91.9275 9.0297 4.1643 4.1519 18.8530 5.1938 11.4088 8.2246 100.6357 7.7692 41.9567 9.7618 12.5511 1.8534 2.6903 98.6874 13.9434 28.1691 30.5309 11.2084 100.4289 339.8250 47.6410 26.6763 170.4769 56.9052 45.9964 34.6460 57.5821 20.9142 22.9931 15.5831 19.0372 20.9549 33.1247 25.8285 4.7774 12.8412 5.4657 14.2448 7.4419 298.4938 58.6655
temp: 298.150 k
press: 1.00000 atm
elementType: 8 8 8 7 6 6 6 6 6 6 6 6 6 6 6 6 6 6 6 6 1 1 1 1 1 1 1 1 1 1 1 1 1 1 1
symmnumber: 1
zpe: 716492.7 jmol-1
zpe.correction: 0.272898 hartree
zpe.thermalcorrener: 0.291194 hartree
zpe.thermalcorrenthalpy: 0.292138 hartree
zpe.thermalcorrgfe: 0.224026 hartree
zpe.sumelectzpe: -897.746816 hartree
zpe.sumelectthermal: -897.728520 hartree
zpe.sumelectthermalent: -897.727575 hartree
zpe.sumelectthermalfe: -897.795687 hartree
dipole: 2.7209 3.1537 0.9555
dipole: 4.2734
quadrupole: -91.4627 -107.8642 -120.4134
quadrupole: -0.6128 2.1952 -3.6854
quadrupole: 15.1173 -1.2841 -13.8333 -0.6128 2.1952 -3.6854
hfenergy: -898.0197135 hartree
pointgroup: C01 [X(C16H15N1O3)]
dipole: -1.0308244 0.4174329 -1.2608886 debye
polarizability: 344.660618|19.0301946|131.5705596|0.0578016|-49.1994879|167.1308022 unknown
InChI: InChI=1S/C16H15NO3/c1-10-7-8-14(11(2)9-10)17-15(18)12-5-3-4-6-13(12)16(19)20/h3-9,17,19H,1-2H3
charge 0 multiplicity 1
35 atoms
O  -0.250626 -1.039034 1.954148
O  -3.129127 2.187309 -1.780611
O  -1.032226 1.258725 -1.881504
N  0.411806 -0.21421 -0.136334
C  1.829618 -0.191106 0.037681
C  2.63318 0.151892 -1.100703
C  4.68256 -0.114081 0.280377
C  4.036195 0.181368 -0.947665
C  2.45986 -0.496877 1.273665
C  3.865228 -0.455578 1.382909
C  -2.016231 -0.673597 0.361402
C  -0.537331 -0.624659 0.781122
C  2.015074 0.471598 -2.451546
C  -2.779736 0.161955 -0.530144
C  6.195995 -0.061314 0.396451
C  -2.73318 -1.66167 1.093567
C  -4.193476 -0.010859 -0.62484
C  -4.120815 -1.849987 0.958021
C  -4.863611 -1.011822 0.096384
C  -2.20576 1.206679 -1.416799
H  4.647925 0.441914 -1.821486
H  1.839871 -0.766071 2.129184
H  0.044538 0.184615 -1.018459
H  4.329086 -0.693501 2.347745
H  2.803393 0.635052 -3.20489
H  1.368889 -0.34981 -2.817802
H  1.386784 1.380765 -2.420083
H  6.682421 -0.725391 -0.342962
H  6.579193 0.961239 0.215102
H  6.532932 -0.371694 1.400402
H  -2.157786 -2.26068 1.804637
H  -4.751193 0.657107 -1.285744
H  -4.619933 -2.637003 1.533319
H  -5.94674 -1.131967 -0.007419
H  -2.690175 2.822294 -2.408728
