program: Gaussian 09
title: 000295108
version: EM64L-G09RevD.01
frameworkgroup: C1[X(C16H15NO3)]
method: RPBEPBE
basis: SDD
operation: Freq
keyword: #p
keyword: freq=noraman
keyword: PBEPBE/SDD
title: #p freq=noraman PBEPBE/SDD
converged: YES YES NO NO
title: Mulliken charges:
elementType: O O O N C C C C C C C C C C C C C C C C H H H H H H H H H H H H H H H
charge: -0.290843 -0.425780 -0.308473 -0.465853 0.509365 -0.537490 0.446170 -0.382836 -0.410894 -0.456688 -0.345637 0.102867 0.118486 0.142333 -0.671581 -0.312823 -0.307519 -0.228101 -0.227914 0.146922 0.206588 0.209490 0.229839 0.229470 0.238766 0.308618 0.375671 0.223789 0.214349 0.220634 0.293967 0.279162 0.241101 0.241388 0.393458
chargesum: 0.00000
title: Mulliken charges with hydrogens summed into heavy atoms:
elementType: O O O N C C C C C C C C C C C C C C C C
charge: -0.290843 -0.032322 -0.308473 -0.090182 0.509365 -0.121412 0.446170 -0.152997 -0.181424 -0.217922 -0.037019 0.102867 0.118486 0.142333 -0.012809 -0.018857 -0.028358 0.013001 0.013474 0.146922
polarizability: 3.54447214e+02 -1.99150568e+01 2.02216082e+02 6.65050428e+00 3.35373344e+00 9.02799351e+01
1716.lowfreq: -4.5022 -0.0008 -0.0006 -0.0005 2.9177 7.0221 24.2190 27.3452 31.9043
frequency: 23.7984 27.3222 31.8249 63.7153 71.0217 74.8050 107.4966 133.6179 180.4408 196.8391 210.1264 241.9660 261.7784 281.5176 333.1381 376.6336 394.3787 402.1608 405.4288 409.8478 431.4287 467.3663 507.6552 546.8963 564.0100 601.7086 616.3290 632.4259 644.7713 674.0317 702.7069 726.1532 744.7363 769.7176 778.6762 785.2506 794.4940 825.5483 831.0176 863.6804 864.9849 915.7341 926.2682 958.9177 967.3563 991.0682 992.1199 1009.3491 1015.1867 1016.8278 1043.5044 1049.4522 1062.3402 1085.5995 1124.1668 1133.2701 1154.3673 1181.9976 1189.7089 1218.9873 1225.5274 1243.3290 1268.9529 1283.0859 1313.4994 1316.0761 1325.0120 1371.6739 1381.3319 1387.9325 1412.7887 1418.0299 1467.5549 1471.6681 1473.4095 1488.7473 1506.7975 1546.1411 1561.5722 1575.6869 1594.7654 1606.3505 1624.7428 1652.4990 2977.5172 2984.7356 3035.6177 3075.7973 3082.8531 3113.1763 3121.5785 3137.4900 3140.3239 3158.5019 3171.6495 3187.7292 3196.6814 3198.0177 3524.5336
redmass: 3.0116 5.1027 4.4579 5.7028 5.2650 5.0549 4.6804 5.1454 4.1749 3.1960 1.9047 3.0217 5.1764 3.7959 3.7205 4.2976 4.5638 5.9526 5.7105 3.0062 4.0401 4.5556 4.7078 4.0642 3.0388 1.3073 4.6083 6.6314 5.6802 4.2589 3.3040 4.2726 3.4946 4.9183 4.2364 1.1830 1.5604 3.6967 1.6210 1.4164 4.6206 1.4221 1.2097 1.3415 2.3793 1.3395 1.3741 2.8325 1.3814 5.3591 1.7328 2.4646 2.0369 2.8782 1.5852 1.4862 1.9169 1.0706 1.1292 2.1621 3.5373 1.2593 1.8685 1.9371 1.5157 1.4981 2.5726 9.0260 4.9212 1.2122 2.6389 2.4366 2.4106 1.0440 1.0711 1.0930 2.6904 4.8252 5.1009 6.7938 5.8845 5.9975 6.4538 1.7260 1.0350 1.0598 1.1016 1.1000 1.1012 1.0872 1.0908 1.0969 1.0869 1.0919 1.0956 1.0963 1.0863 1.0934 1.0641
irintensity: 0.0863 2.3563 0.4589 0.7330 0.5350 0.9829 2.5521 1.1823 2.1889 0.9284 0.4840 3.1591 0.8050 1.0755 9.0437 0.2925 1.7658 10.8219 5.8016 0.6959 9.9941 1.7192 5.3112 14.4323 30.7396 94.3607 57.3013 0.5167 9.9327 0.7679 97.2780 2.2981 1.0576 4.1058 6.3285 2.9579 43.0007 3.1309 12.5944 27.8662 35.8175 0.9966 105.6723 28.3117 7.4161 0.6673 9.2257 1.5481 2.5280 215.6258 8.3371 7.9093 25.4487 64.4819 58.9554 3.6139 103.5625 4.6382 1.7112 0.4416 11.4544 0.2983 9.0669 7.7359 3.7570 19.5023 93.7048 19.5796 47.7804 9.6227 12.1285 6.8097 56.8527 14.2413 1.5541 6.4936 105.3155 296.9518 42.6472 38.0153 345.0791 28.3189 10.8095 23.3291 49.7221 48.7780 8.7037 73.5768 39.3955 18.1141 31.7312 12.0705 5.4349 9.5796 13.8241 11.4342 420.4272 70.2711 64.5309
temp: 298.150 k
press: 1.00000 atm
elementType: 8 8 8 7 6 6 6 6 6 6 6 6 6 6 6 6 6 6 6 6 1 1 1 1 1 1 1 1 1 1 1 1 1 1 1
symmnumber: 1
zpe: 719320.8 jmol-1
zpe.correction: 0.273975 hartree
zpe.thermalcorrener: 0.291799 hartree
zpe.thermalcorrenthalpy: 0.292743 hartree
zpe.thermalcorrgfe: 0.225790 hartree
zpe.sumelectzpe: -897.741960 hartree
zpe.sumelectthermal: -897.724136 hartree
zpe.sumelectthermalent: -897.723192 hartree
zpe.sumelectthermalfe: -897.790144 hartree
dipole: 2.7842 2.8080 0.8623
dipole: 4.0472
quadrupole: -87.8419 -106.3539 -122.3256
quadrupole: 0.7346 2.9360 -2.2268
quadrupole: 17.6653 -0.8468 -16.8185 0.7346 2.9360 -2.2268
hfenergy: -898.0159348 hartree
pointgroup: C01 [X(C16H15N1O3)]
dipole: -1.0614968 0.6402371 -0.9993818 debye
polarizability: 353.8740053|25.4345082|156.7866144|3.690599|-54.2030299|136.2826118 unknown
InChI: InChI=1S/C16H15NO3/c1-2-11-7-9-12(10-8-11)17-15(18)13-5-3-4-6-14(13)16(19)20/h3-10,17,19H,2H2,1H3
charge 0 multiplicity 1
35 atoms
O  -0.438333 -1.497202 1.613493
O  -3.391633 2.350223 -1.650133
O  -1.238166 1.576742 -1.690455
N  0.158791 -0.075807 -0.140065
C  4.413634 0.237335 0.25268
C  5.930385 0.330662 0.333372
C  1.567873 -0.013033 0.047186
C  3.689945 0.930971 -0.75319
C  3.677001 -0.576287 1.149527
C  2.292243 0.812045 -0.859133
C  2.275072 -0.711344 1.063509
C  -2.246208 -0.724085 0.203264
C  -0.760691 -0.773256 0.611991
C  -2.998867 0.227326 -0.582156
C  6.636933 -0.698397 -0.590877
C  -2.97629 -1.792669 0.794932
C  -4.412728 0.066722 -0.709959
C  -4.364193 -1.953214 0.63332
C  -5.094853 -1.011013 -0.123327
C  -2.433986 1.391095 -1.320055
H  6.261583 1.349711 0.054063
H  6.26135 0.162879 1.376124
H  4.228577 1.576215 -1.458439
H  4.210638 -1.117395 1.941204
H  1.751583 1.361971 -1.639249
H  1.720326 -1.335611 1.765153
H  -0.218099 0.516081 -0.90683
H  6.35211 -1.730818 -0.318737
H  7.736526 -0.610639 -0.513261
H  6.351742 -0.540034 -1.646872
H  -2.401321 -2.484551 1.417112
H  -4.963953 0.810236 -1.289978
H  -4.871001 -2.802819 1.103217
H  -6.177456 -1.110264 -0.2517
H  -2.948034 3.073725 -2.16983
