program: Gaussian 09
title: 000295095
version: EM64L-G09RevD.01
frameworkgroup: C1[X(C15H14ClNO)]
method: RPBEPBE
basis: SDD
operation: Freq
keyword: #p
keyword: freq=noraman
keyword: PBEPBE/SDD
title: #p freq=noraman PBEPBE/SDD
converged: NO YES NO NO
title: Mulliken charges:
elementType: Cl O N C C C C C C C C C C C C C C C H H H H H H H H H H H H H H
charge: -0.060642 -0.260135 -0.488967 0.336537 0.264638 0.487545 -0.484014 -0.381849 -0.458463 -0.848805 0.131617 0.271761 -0.814842 -0.329459 -0.356867 -0.102418 -0.203102 -0.230497 0.308528 0.226926 0.340417 0.232399 0.229579 0.227026 0.248374 0.233937 0.233791 0.219464 0.246041 0.279854 0.239932 0.261692
chargesum: 0.00000
title: Mulliken charges with hydrogens summed into heavy atoms:
elementType: Cl O N C C C C C C C C C C C C C C C
charge: -0.060642 -0.260135 -0.148550 0.336537 0.264638 0.487545 -0.175486 -0.154923 -0.226063 -0.143826 0.131617 0.271761 -0.127649 -0.083418 -0.077013 -0.102418 0.036830 0.031194
polarizability: 2.90762486e+02 -1.81941215e+00 2.03582669e+02 7.41460557e+00 -2.98755468e+00 8.63963027e+01
1716.lowfreq: -8.2137 -4.5080 -0.2106 0.0017 0.0017 0.0023 17.5795 39.1638 41.4482
frequency: 17.4803 39.1550 41.4421 53.4999 81.1764 125.8184 138.1063 150.5539 188.2850 191.8967 224.9372 247.4725 281.1923 310.4094 320.9662 331.2623 371.7708 418.1797 445.5212 446.7472 452.4584 468.3869 507.4832 583.3202 598.2729 644.1525 650.6070 673.9706 713.0144 716.3723 725.2602 734.6265 779.4816 806.9965 815.3610 875.5136 882.0484 927.7057 928.4744 932.9703 953.0604 983.0949 993.3832 995.2160 1012.7488 1041.9944 1051.1068 1066.1092 1080.6393 1100.5681 1142.2370 1169.7961 1175.3968 1213.6868 1248.1561 1274.6801 1290.4029 1297.9896 1371.9225 1377.7054 1395.4324 1398.3667 1409.7129 1422.9104 1448.5602 1466.2323 1469.7701 1477.3138 1482.1246 1488.8574 1530.9612 1564.3272 1589.8830 1602.3534 1608.7906 1628.5672 2950.9246 2979.2103 3018.5769 3058.3407 3085.7598 3086.7339 3120.0766 3143.0575 3144.9798 3147.8711 3169.1158 3177.8685 3179.4974 3543.2862
redmass: 4.8307 4.6910 1.0895 6.0587 5.5404 3.0571 5.2940 5.0267 1.6122 1.8987 4.7333 3.9182 5.1216 3.3522 4.3994 4.4334 9.0994 3.6370 4.0741 3.5699 3.0658 4.3280 5.6495 2.8580 5.7367 1.7909 3.0934 3.3383 4.5510 5.6142 3.4351 3.2598 5.5642 1.5058 1.2594 1.7739 4.4256 1.4510 1.3549 2.0304 1.3712 5.8380 1.7089 1.3888 1.4933 1.5277 1.5574 3.0163 1.9326 1.8631 1.9793 1.8592 1.0967 1.7642 3.1156 2.1027 1.3299 1.7123 5.0001 8.7075 1.2705 1.2387 2.9115 4.0409 1.9579 1.7598 1.0465 1.2282 1.0466 1.3995 2.2306 6.3455 6.0760 5.8899 5.8911 5.7523 1.0403 1.0370 1.0978 1.0976 1.0990 1.0942 1.0874 1.0922 1.0968 1.0876 1.0928 1.0927 1.0992 1.0753
irintensity: 0.2032 1.6729 1.4780 0.8865 4.4104 0.5296 3.6711 1.9783 1.4688 0.1821 0.1360 1.9390 0.4525 2.6323 5.1740 4.3884 3.5994 3.7144 1.9881 10.0730 7.3779 2.1409 4.5528 1.9906 10.0717 50.7205 13.9703 5.7163 19.4044 29.8735 39.7137 9.3610 12.6994 29.8339 40.0647 11.1481 15.3379 1.5734 9.6747 2.2229 4.6953 4.8773 17.8587 1.5902 1.9763 3.1950 19.1452 23.8872 13.0152 9.8012 6.1342 3.3380 3.4621 11.0767 141.1605 9.9364 3.0116 20.9127 36.8272 0.1418 13.7529 15.1835 15.4909 133.6879 104.5249 46.1532 12.9208 80.2148 17.4282 9.8389 292.7804 105.3581 66.4291 16.0706 36.4309 10.2925 35.6884 35.7914 23.1017 19.3991 19.1296 22.4424 12.4581 5.0271 30.9341 7.1664 0.3524 7.1212 8.7113 18.7312
temp: 298.150 k
press: 1.00000 atm
elementType: 17 8 7 6 6 6 6 6 6 6 6 6 6 6 6 6 6 6 1 1 1 1 1 1 1 1 1 1 1 1 1 1
symmnumber: 1
zpe: 654786.2 jmol-1
zpe.correction: 0.249395 hartree
zpe.thermalcorrener: 0.266319 hartree
zpe.thermalcorrenthalpy: 0.267263 hartree
zpe.thermalcorrgfe: 0.202505 hartree
zpe.sumelectzpe: -1168.786307 hartree
zpe.sumelectthermal: -1168.769383 hartree
zpe.sumelectthermalent: -1168.768439 hartree
zpe.sumelectthermalfe: -1168.833197 hartree
dipole: 0.2938 1.5682 1.1138
dipole: 1.9458
quadrupole: -101.1734 -108.9818 -116.8830
quadrupole: -10.1670 3.8457 -0.4864
quadrupole: 7.8393 0.0310 -7.8703 -10.1670 3.8457 -0.4864
hfenergy: -1169.0357017 hartree
pointgroup: C01 [X(C15H14Cl1N1O1)]
dipole: -0.0443587 -0.7428764 0.1795183 debye
polarizability: 284.6609333|-30.810643|141.1427943|-8.7416001|-57.3463757|154.9377302 unknown
InChI: InChI=1S/C15H14ClNO/c1-10-6-7-11(2)14(8-10)17-15(18)12-4-3-5-13(16)9-12/h3-9,17H,1-2H3
charge 0 multiplicity 1
32 atoms
Cl 4.377646 -1.995205 2.192282
O  0.222672 1.305936 -1.482099
N  -0.420454 -0.380324 0.02914
C  -1.829228 -0.179667 0.138105
C  -2.555366 -1.101743 0.959232
C  -3.895697 1.052542 -0.383835
C  -2.496871 0.880463 -0.524219
C  -3.948067 -0.913014 1.084119
C  -4.617108 0.144945 0.427391
C  -1.859911 -2.246444 1.678567
C  0.515589 0.344648 -0.705715
C  1.949115 -0.107394 -0.537444
C  -4.594273 2.196078 -1.099283
C  2.420959 -0.77822 0.622778
C  2.856157 0.200173 -1.58288
C  3.777026 -1.14422 0.692066
C  4.21002 -0.18086 -1.487846
C  4.68741 -0.865208 -0.344723
H  -1.913988 1.559592 -1.150377
H  -4.520421 -1.608795 1.709201
H  -0.062778 -1.198213 0.525229
H  -5.700312 0.261951 0.546424
H  -1.355118 -2.942302 0.977749
H  -1.102599 -1.889588 2.406602
H  -2.590161 -2.844279 2.248106
H  -4.200516 3.175376 -0.76856
H  -4.43849 2.139168 -2.192714
H  -5.681508 2.187352 -0.910691
H  1.771375 -0.973513 1.48243
H  2.475947 0.745369 -2.451891
H  4.90449 0.053006 -2.301251
H  5.736364 -1.162306 -0.258892
