program: Gaussian 09
title: 000295099
version: EM64L-G09RevD.01
frameworkgroup: C1[X(C16H16ClNO)]
method: RPBEPBE
basis: SDD
operation: Freq
keyword: #p
keyword: freq=noraman
keyword: PBEPBE/SDD
title: #p freq=noraman PBEPBE/SDD
converged: YES YES NO NO
title: Mulliken charges:
elementType: Cl O N C C C C C C C C C C C C C C C C H H H H H H H H H H H H H H H H
charge: -0.052465 -0.246681 -0.494280 0.162040 0.379931 0.352257 0.488736 -0.598114 -0.605980 -0.829057 -0.844033 -0.816378 0.125106 0.282473 -0.314382 -0.390334 -0.098636 -0.215151 -0.223220 0.237040 0.236848 0.310679 0.220231 0.287962 0.217226 0.246895 0.220196 0.239797 0.222603 0.224697 0.237526 0.299375 0.239297 0.236557 0.261240
chargesum: 0.00000
title: Mulliken charges with hydrogens summed into heavy atoms:
elementType: Cl O N C C C C C C C C C C C C C C C C
charge: -0.052465 -0.246681 -0.183600 0.162040 0.379931 0.352257 0.488736 -0.361074 -0.369132 -0.103639 -0.137146 -0.131552 0.125106 0.282473 -0.015006 -0.151037 -0.098636 0.021406 0.038020
polarizability: 3.09484438e+02 -4.18641154e+00 1.60273454e+02 -2.33512729e+00 8.87939337e+00 1.39399220e+02
1716.lowfreq: -3.2366 0.0014 0.0018 0.0020 4.5949 5.3719 24.7782 33.1687 40.3922
frequency: 24.7204 33.1022 40.3756 44.1629 93.0423 106.6610 140.5473 158.1707 166.7211 174.8185 189.4901 193.9841 201.4317 230.0022 273.0008 299.3789 322.5940 334.3061 364.9776 388.4015 418.7485 441.4296 484.2343 498.7266 517.4584 537.4837 549.9944 563.7248 568.2747 606.8373 645.8425 677.3148 697.1877 721.7145 733.8342 793.4771 811.0685 863.5349 877.9524 895.7796 908.9023 925.4677 942.7172 956.2502 978.1983 985.1713 1014.1522 1020.4357 1039.5591 1043.4407 1046.7972 1052.7940 1071.9807 1087.1258 1095.3908 1167.6468 1180.6993 1230.5924 1245.6160 1263.5259 1286.4291 1324.0143 1369.2718 1380.6225 1396.8481 1397.3275 1399.1343 1410.5300 1416.9783 1445.9767 1452.8855 1458.9536 1468.4648 1473.5036 1474.4295 1476.1473 1491.7867 1495.8953 1569.2584 1600.1648 1600.9850 1606.2897 1622.0663 2958.3845 2974.3442 2977.8360 3037.9166 3055.4052 3058.1187 3083.6744 3086.9681 3089.2549 3116.5758 3120.8420 3131.7643 3153.6531 3170.9053 3176.9500 3514.9243
redmass: 6.6197 3.9446 1.0835 4.1711 4.2155 6.1932 4.0630 1.1917 1.4987 5.0494 1.8663 4.4885 5.1021 2.6211 2.5285 3.0133 4.7502 4.5548 4.6712 9.7547 4.4476 4.1538 4.5150 3.6174 3.1032 4.9770 3.9507 3.0821 2.5486 1.6474 6.4289 3.3562 6.6737 2.9959 3.1857 1.9374 3.2689 1.5306 3.6175 1.3130 1.3953 1.4728 2.2821 3.4002 1.4770 4.3174 1.6534 1.6219 1.6280 1.6987 1.5459 1.6244 2.4515 2.1245 2.0970 1.8683 1.0872 2.6582 1.7954 1.5326 1.4209 5.8351 6.3308 9.9085 1.2933 1.2271 1.2502 2.6345 2.5711 1.7186 1.3584 1.6682 1.3170 1.2263 1.0802 1.1104 1.3814 1.5203 6.5257 6.8292 6.8739 5.8877 6.1751 1.0429 1.0385 1.0365 1.0916 1.0951 1.0968 1.0998 1.0997 1.0979 1.0912 1.0919 1.0876 1.0929 1.0927 1.0978 1.0757
irintensity: 0.1419 0.4565 0.7367 0.6053 2.5912 0.6202 1.4268 2.7388 2.8769 0.7662 4.0374 0.4244 3.1446 0.7336 1.0785 0.2171 1.3667 3.3327 3.1528 8.8388 2.2427 5.8961 8.5915 3.8812 0.1808 4.0188 0.6431 10.0353 20.5610 46.3852 0.2951 4.3735 82.9524 29.7517 35.7930 22.2085 13.6347 9.8645 14.1958 0.6312 1.6813 13.7831 0.8216 0.3741 0.2646 1.8090 10.2526 4.4540 3.5574 2.2239 9.3988 17.6171 22.6818 2.8314 1.0247 0.8029 2.6519 59.6417 85.7748 55.8930 24.2431 0.2728 48.3818 1.2667 33.8694 12.4023 2.0141 5.7584 12.0882 72.2189 121.4940 13.5886 68.5212 75.5991 20.5491 11.8754 120.6171 24.9189 85.2009 12.1504 7.8961 65.7080 19.2713 36.3858 43.8008 22.8786 18.7179 22.7165 10.6895 16.5739 23.9708 21.0145 26.6252 18.8671 9.4471 9.9678 1.9641 8.0229 12.7148
temp: 298.150 k
press: 1.00000 atm
elementType: 17 8 7 6 6 6 6 6 6 6 6 6 6 6 6 6 6 6 6 1 1 1 1 1 1 1 1 1 1 1 1 1 1 1 1
symmnumber: 1
zpe: 725334.4 jmol-1
zpe.correction: 0.276265 hartree
zpe.thermalcorrener: 0.294878 hartree
zpe.thermalcorrenthalpy: 0.295822 hartree
zpe.thermalcorrgfe: 0.227876 hartree
zpe.sumelectzpe: -1208.010989 hartree
zpe.sumelectthermal: -1207.992376 hartree
zpe.sumelectthermalent: -1207.991432 hartree
zpe.sumelectthermalfe: -1208.059377 hartree
dipole: 1.6341 3.6130 2.9284
dipole: 4.9295
quadrupole: -112.1328 -115.5210 -117.6910
quadrupole: -4.9647 -8.8336 -0.6747
quadrupole: 2.9821 -0.4061 -2.5761 -4.9647 -8.8336 -0.6747
hfenergy: -1208.2872538 hartree
pointgroup: C01 [X(C16H16Cl1N1O1)]
dipole: -0.5333104 -0.0087796 -1.864609 debye
polarizability: 309.5224767|-1.1618728|138.8391079|3.9989258|-8.1743271|160.7955274 unknown
InChI: InChI=1S/C16H16ClNO/c1-10-7-11(2)15(12(3)8-10)18-16(19)13-5-4-6-14(17)9-13/h4-9,18H,1-3H3
charge 0 multiplicity 1
35 atoms
Cl 5.816464 0.542713 1.674948
O  0.451087 -0.27672 1.778069
N  -0.252457 -0.090861 -0.452423
C  -1.673257 -0.020419 -0.238736
C  -2.366542 -1.057917 0.448586
C  -2.373566 1.094869 -0.787369
C  -4.492697 0.167571 0.08071
C  -3.769437 -0.932109 0.598822
C  -3.774628 1.165242 -0.623423
C  -1.655532 -2.281665 0.985944
C  -1.628046 2.195431 -1.523504
C  -5.992742 0.284589 0.287948
C  0.720151 -0.228109 0.539931
C  2.142899 -0.297183 0.032928
C  3.164983 0.085784 0.938885
C  2.489627 -0.749405 -1.267216
C  4.502369 0.036109 0.51704
C  3.844745 -0.795785 -1.663667
C  4.867771 -0.39486 -0.77503
H  -4.310116 -1.727166 1.127696
H  -4.31493 2.023814 -1.041639
H  0.080032 0.174923 -1.382592
H  -2.374646 -3.088084 1.20853
H  -1.099903 -2.033548 1.908726
H  -0.911092 -2.667775 0.264583
H  -0.787882 2.587849 -0.920805
H  -1.20539 1.846872 -2.488569
H  -2.302403 3.036418 -1.755132
H  -6.474935 0.839509 -0.536186
H  -6.470869 -0.70843 0.358047
H  -6.222393 0.825466 1.226796
H  2.885369 0.400578 1.948531
H  1.718634 -1.109136 -1.957925
H  4.112708 -1.155168 -2.662687
H  5.919425 -0.426898 -1.07362
