program: Gaussian 09
title: 000295075
version: EM64L-G09RevD.01
frameworkgroup: C1[X(C14H13FN2O)]
method: RPBEPBE
basis: SDD
operation: Freq
keyword: #p
keyword: freq=noraman
keyword: PBEPBE/SDD
title: #p freq=noraman PBEPBE/SDD
converged: NO YES NO NO
title: Mulliken charges:
elementType: F O N N C C C C C C C C C C C C C C H H H H H H H H H H H H H
charge: -0.228733 -0.283541 -0.506478 -0.502945 0.311667 0.269652 -0.329507 -0.383400 0.311778 -0.848993 0.268482 -0.234556 -0.251810 0.120824 -0.297890 -0.325763 -0.224093 -0.221866 0.317373 0.304961 0.227309 0.227514 0.227528 0.249238 0.317029 0.226799 0.227029 0.313288 0.254135 0.230142 0.234827
chargesum: 0.00000
title: Mulliken charges with hydrogens summed into heavy atoms:
elementType: F O N N C C C C C C C C C C C C C C
charge: -0.228733 -0.283541 -0.189105 -0.185916 0.311667 0.269652 -0.024546 -0.156091 0.311778 -0.144712 0.268482 -0.007758 -0.024781 0.120824 0.015398 -0.071628 0.006049 0.012961
polarizability: 2.97132053e+02 2.06263208e+00 1.77269918e+02 6.84699181e-03 -7.81023515e-03 7.07486373e+01
1716.lowfreq: -0.0008 -0.0005 -0.0001 5.7444 9.7298 17.6531 26.5111 37.7314 69.9219
frequency: 26.2074 37.5977 69.9151 77.8163 88.2087 170.2059 170.3766 190.3190 194.7707 199.1421 279.4067 283.2905 298.2433 311.4559 409.2330 432.3444 443.8149 445.3353 477.2672 495.9446 527.0516 545.5705 559.7577 560.7760 622.5742 654.2896 701.5911 713.9490 725.8211 727.6183 757.9105 766.8031 780.2785 782.6603 820.2651 860.6869 880.2612 880.7911 939.2635 952.8023 978.0424 988.5451 995.8282 1000.2025 1029.1908 1042.1653 1048.4290 1077.0144 1115.4371 1156.5838 1169.9370 1174.2724 1187.8381 1197.3319 1250.9376 1273.1202 1298.7576 1313.6441 1374.6039 1385.0846 1395.4198 1440.9720 1442.3534 1458.4149 1471.6979 1483.5083 1488.5741 1517.6204 1528.1771 1590.8755 1598.8314 1620.7396 1629.8343 1656.7456 2949.8697 3017.3631 3087.4172 3122.1581 3137.3145 3143.8228 3161.2988 3161.7529 3180.4260 3196.1416 3200.4221 3516.5323 3538.5532
redmass: 4.6987 5.9275 5.4553 5.7515 4.8686 3.1485 5.7578 4.7749 5.9774 1.0762 2.7906 4.4879 6.8764 6.6987 4.2731 2.5407 3.0582 4.8334 1.6623 7.1724 7.1335 3.5046 3.1295 6.6222 6.5884 1.2015 9.3477 4.6565 6.1462 2.9854 1.2364 1.3296 6.2245 5.9414 5.1556 1.3435 5.5268 1.3022 1.3417 1.3661 1.5545 1.2913 1.3029 7.2930 2.0174 1.5212 2.1228 2.7798 1.8523 1.6421 1.1392 1.1008 2.8547 1.9310 1.7160 2.0612 1.6217 2.1199 5.2811 5.9269 1.2798 2.3744 2.6824 1.7624 2.3282 1.0445 1.5294 2.2186 2.2995 5.3072 5.7248 5.8482 7.2758 3.6612 1.0402 1.0979 1.0941 1.0872 1.0901 1.0868 1.0985 1.0922 1.0983 1.0946 1.0951 1.0764 1.0754
irintensity: 0.4019 0.6795 0.4720 8.5648 1.1542 0.2707 9.7074 1.9355 0.0920 0.7512 3.1675 4.1718 0.2642 6.1457 4.9758 0.4971 15.4232 9.2420 5.9154 8.2583 1.5789 5.6274 0.9669 2.9917 0.0465 122.7174 20.7231 9.4330 4.6621 1.7343 108.4375 110.8633 13.4218 2.1065 5.2710 2.0293 0.2885 3.6035 7.4075 4.2165 5.1719 2.8034 2.7583 1.3153 19.0868 6.7142 16.5326 32.6713 2.9882 15.6064 3.5846 0.0288 264.2450 19.0579 58.5877 97.3517 133.1104 19.2726 52.7515 210.3945 33.5411 66.5295 113.4143 137.7357 33.0910 14.7862 180.3166 1029.2419 19.0090 16.5417 84.1770 4.8690 88.7606 91.7004 33.8529 24.3999 18.5700 9.5602 18.7865 3.9696 31.4635 14.2009 7.6386 10.1740 8.4192 22.7145 38.8286
temp: 298.150 k
press: 1.00000 atm
elementType: 9 8 7 7 6 6 6 6 6 6 6 6 6 6 6 6 6 6 1 1 1 1 1 1 1 1 1 1 1 1 1
symmnumber: 1
zpe: 631959.7 jmol-1
zpe.correction: 0.240701 hartree
zpe.thermalcorrener: 0.256514 hartree
zpe.thermalcorrenthalpy: 0.257458 hartree
zpe.thermalcorrgfe: 0.196370 hartree
zpe.sumelectzpe: -824.615438 hartree
zpe.sumelectthermal: -824.599625 hartree
zpe.sumelectthermalent: -824.598680 hartree
zpe.sumelectthermalfe: -824.659769 hartree
dipole: -0.0658 2.6798 -0.0004
dipole: 2.6806
quadrupole: -87.7615 -98.6269 -111.2322
quadrupole: 7.2253 0.0046 0.0072
quadrupole: 11.4454 0.5799 -12.0253 7.2253 0.0046 0.0072
hfenergy: -824.8561386 hartree
pointgroup: C01 [X(C14H13F1N2O1)]
dipole: 0.0304325 -1.0541743 -0.0001665 debye
polarizability: 297.1120122|2.5799577|177.2899589|-0.0068806|0.0077806|70.7486373 unknown
InChI: InChI=1S/C14H13FN2O/c1-10-6-2-4-8-12(10)16-14(18)17-13-9-5-3-7-11(13)15/h2-9,16-17H,1H3
charge 0 multiplicity 1
31 atoms
F  3.076257 -2.342619 0.000128
O  0.002216 1.600576 0.003266
N  -1.175624 -0.450584 0.003721
N  1.152058 -0.456006 0.003681
C  -2.53302 -0.014189 0.00168
C  -3.541926 -1.030918 -0.000124
C  -2.896458 1.358104 0.001406
C  -4.897597 -0.631561 -0.002136
C  2.488473 0.003258 0.001608
C  -3.174681 -2.506989 0.000096
C  -0.01382 0.335881 0.005424
C  -4.259824 1.719925 -0.000634
C  -5.268652 0.732115 -0.002416
C  3.507952 -0.983473 -0.000254
C  2.903275 1.361822 0.001252
C  4.8742 -0.697214 -0.002383
C  4.281162 1.674203 -0.000899
C  5.268865 0.662502 -0.002717
H  -1.054815 -1.464743 0.003499
H  -2.111627 2.115849 0.002805
H  -5.6736 -1.406433 -0.003521
H  -2.587592 -2.795438 -0.896156
H  -2.590526 -2.7959 0.898115
H  -4.082919 -3.131496 -0.001549
H  1.062844 -1.475359 0.003409
H  -4.528783 2.782062 -0.000819
H  -6.326542 1.015128 -0.004003
H  2.140643 2.141745 0.002675
H  5.600706 -1.514716 -0.003737
H  4.582572 2.726978 -0.001142
H  6.332381 0.919789 -0.004372
