program: Gaussian 09
title: 000295127
version: EM64L-G09RevD.01
frameworkgroup: C1[X(C14H10Cl3NO)]
method: RPBEPBE
basis: SDD
operation: Freq
keyword: #p
keyword: freq=noraman
keyword: PBEPBE/SDD
title: #p freq=noraman PBEPBE/SDD
converged: YES YES NO NO
title: Mulliken charges:
elementType: Cl Cl Cl O N C C C C C C C C C C C C C C H H H H H H H H H H
charge: -0.063432 -0.064552 -0.024252 -0.279204 -0.457679 0.314805 0.288739 0.314970 -0.317828 -0.363742 0.176682 -0.837617 -0.234860 -0.112523 -0.237568 -0.288945 -0.215064 -0.230175 -0.095205 0.326853 0.317341 0.257899 0.246073 0.237639 0.235773 0.256200 0.296913 0.285173 0.267588
chargesum: 0.00000
title: Mulliken charges with hydrogens summed into heavy atoms:
elementType: Cl Cl Cl O N C C C C C C C C C C C C C C
charge: -0.063432 -0.064552 -0.024252 -0.279204 -0.130826 0.314805 0.288739 0.314970 -0.000488 -0.105843 0.176682 -0.118131 0.021340 -0.112523 -0.237568 0.007967 0.070108 0.037413 -0.095205
polarizability: 3.74881155e+02 8.54768067e+00 1.90314045e+02 -2.08833790e+00 1.19877483e+00 7.47669359e+01
1716.lowfreq: -6.1329 -1.5306 -0.0016 -0.0009 0.0026 5.6597 7.1527 22.6657 60.0016
frequency: 7.0518 22.6563 59.9999 66.2683 80.3942 144.7699 158.1992 159.3290 178.3643 183.2578 203.7127 212.8886 236.5707 277.7401 293.1091 339.3253 363.5844 373.3595 386.1062 436.8455 442.8900 450.1509 476.6403 521.0899 532.6691 548.7618 552.7146 641.1098 654.8894 656.9464 680.1775 725.3506 733.1486 744.0175 785.9452 842.4442 849.8320 859.5415 863.1361 871.6483 874.7207 981.8786 993.0172 994.4795 1005.6471 1043.3203 1084.3055 1091.8041 1095.4417 1128.5552 1132.0273 1194.5386 1222.5438 1249.4607 1265.8061 1285.9637 1341.6432 1370.4670 1384.3797 1399.0202 1402.4156 1444.0401 1460.9520 1481.4723 1482.5413 1525.5589 1546.1010 1583.0437 1585.5749 1602.1732 1613.3900 2966.9335 3039.6030 3093.7604 3155.8479 3157.5984 3169.5942 3180.7251 3184.8066 3201.9245 3477.6621
redmass: 7.6415 8.8063 7.6426 9.8442 8.3544 5.5245 6.6590 7.8057 11.0139 2.5171 6.6791 1.3448 5.0164 6.6639 6.5332 16.8802 5.3933 9.7800 8.2156 4.8627 3.2794 3.1625 5.1165 6.4468 5.8907 5.1022 3.8950 7.3676 5.2621 5.2207 1.3131 3.5503 7.2576 4.4112 5.6990 1.3700 1.4448 6.0773 1.4213 1.3439 6.9220 1.3159 1.5381 1.3471 5.1778 1.5192 4.4496 2.1120 2.0354 1.9057 1.4237 1.9267 2.7180 1.4194 1.5448 2.2087 3.7725 6.8237 6.1580 3.1063 1.3448 2.3988 1.9459 1.0737 1.4268 2.2391 6.8032 8.1449 6.1973 5.6782 3.5151 1.0394 1.0977 1.0961 1.0891 1.0926 1.0915 1.0958 1.0941 1.0947 1.0769
irintensity: 1.3657 0.0545 2.2757 1.8732 3.2463 0.4441 0.3559 1.6609 0.4595 2.5960 0.7587 0.1886 0.3435 0.4558 1.1809 3.0643 1.1459 4.6342 47.9655 8.6015 1.5252 15.1677 3.4091 7.7130 0.7185 8.7135 16.1883 13.8048 3.2175 7.0900 48.7292 7.0979 23.2243 18.5644 18.2356 46.6395 33.4330 40.9587 20.7993 17.9013 81.6881 3.6242 5.1499 2.8165 38.3422 7.4612 10.2175 39.7259 3.4882 3.6643 40.3880 26.4603 41.3384 27.0459 2.3890 41.3912 4.8556 50.3077 44.1947 45.5578 8.8549 118.7508 29.1230 34.1939 196.5624 391.3332 5.5219 88.2530 82.3368 78.0953 53.3240 19.7338 16.4846 21.4243 6.0006 3.9228 1.7445 3.2454 1.0182 11.6583 107.8235
temp: 298.150 k
press: 1.00000 atm
elementType: 17 17 17 8 7 6 6 6 6 6 6 6 6 6 6 6 6 6 6 1 1 1 1 1 1 1 1 1 1
symmnumber: 1
zpe: 533004.4 jmol-1
zpe.correction: 0.203011 hartree
zpe.thermalcorrener: 0.220583 hartree
zpe.thermalcorrenthalpy: 0.221527 hartree
zpe.thermalcorrgfe: 0.154223 hartree
zpe.sumelectzpe: -2048.332578 hartree
zpe.sumelectthermal: -2048.315005 hartree
zpe.sumelectthermalent: -2048.314061 hartree
zpe.sumelectthermalfe: -2048.381366 hartree
dipole: -2.5444 2.3449 0.3965
dipole: 3.4828
quadrupole: -145.6277 -123.3419 -134.9988
quadrupole: 6.2724 -0.1092 0.0731
quadrupole: -10.9715 11.3142 -0.3427 6.2724 -0.1092 0.0731
hfenergy: -2048.5355884 hartree
pointgroup: C01 [X(C14H10Cl3N1O1)]
dipole: -0.9841894 -0.3611044 -0.8823171 debye
polarizability: 374.7610465|8.1558475|100.9358286|-9.0425133|47.9040902|164.2652604 unknown
InChI: InChI=1S/C14H10Cl3NO/c1-8-6-9(15)3-5-13(8)18-14(19)11-4-2-10(16)7-12(11)17/h2-7,18H,1H3
charge 0 multiplicity 1
29 atoms
Cl 6.559845 0.198643 0.280337
Cl -1.553218 -1.750265 -1.858086
Cl -6.540049 -0.506504 0.044504
O  -0.162453 0.575769 2.017244
N  0.528363 -0.332323 -0.023374
C  1.943629 -0.190971 0.093015
C  2.73909 -0.622006 -1.019268
C  -1.907428 -0.185124 0.538775
C  2.568223 0.352091 1.248302
C  4.14389 -0.492922 -0.937981
C  -0.44022 0.038476 0.897633
C  2.111487 -1.209795 -2.271752
C  3.971953 0.471826 1.311134
C  4.741927 0.047755 0.215573
C  -2.511912 -0.88264 -0.540273
C  -2.812579 0.408286 1.469082
C  -3.907723 -0.992362 -0.702753
C  -4.208747 0.327454 1.343245
C  -4.742377 -0.377269 0.246974
H  0.195944 -0.763039 -0.891172
H  1.948331 0.675815 2.084717
H  4.766852 -0.815765 -1.777587
H  2.88618 -1.455009 -3.015933
H  1.556492 -2.144421 -2.058367
H  1.405878 -0.505816 -2.755195
H  4.448787 0.889343 2.202227
H  -2.353762 0.935587 2.311552
H  -4.327078 -1.543629 -1.547352
H  -4.865425 0.799212 2.078481
