program: Gaussian 09
title: 000295083
version: EM64L-G09RevD.01
frameworkgroup: C1[X(C15H14ClNO)]
method: RPBEPBE
basis: SDD
operation: Freq
keyword: #p
keyword: freq=noraman
keyword: PBEPBE/SDD
title: #p freq=noraman PBEPBE/SDD
converged: YES YES NO NO
title: Mulliken charges:
elementType: Cl O N C C C C C C C C C C C C C C C H H H H H H H H H H H H H H
charge: -0.080713 -0.281910 -0.453630 0.302102 0.275324 0.470522 -0.535819 -0.330677 -0.443546 -0.846047 0.167470 0.294930 -0.814882 -0.250470 -0.304803 -0.232122 -0.237611 -0.217897 0.230931 0.310276 0.230743 0.327660 0.240314 0.231933 0.234571 0.226734 0.230074 0.225761 0.290771 0.258694 0.240015 0.241303
chargesum: 0.00000
title: Mulliken charges with hydrogens summed into heavy atoms:
elementType: Cl O N C C C C C C C C C C C C C C C
charge: -0.080713 -0.281910 -0.125970 0.302102 0.275324 0.470522 -0.304888 -0.020400 -0.212802 -0.139229 0.167470 0.294930 -0.132314 -0.250470 -0.014032 0.026572 0.002404 0.023406
polarizability: 3.19705218e+02 -1.20452332e+01 1.93220110e+02 4.32236990e+00 9.70612080e-01 8.07747864e+01
1716.lowfreq: -5.8880 -1.4652 -0.0018 -0.0010 0.0010 6.9850 7.9931 17.1759 31.0261
frequency: 7.0260 16.3168 30.9781 66.8502 85.3612 110.9629 154.3980 181.9347 187.4181 213.1937 218.4752 229.4820 277.3513 284.5014 335.6839 361.3774 406.0129 436.5718 448.3861 451.4673 463.3658 490.9862 528.4386 545.0695 563.0482 631.0101 666.1321 680.6830 695.3777 713.3994 735.4485 741.5931 777.3547 787.7394 847.8920 871.7449 881.9948 887.3141 929.5298 969.7961 979.1504 988.1931 1000.3459 1005.8322 1019.0527 1036.6425 1042.3320 1048.3231 1095.0743 1114.7451 1137.1262 1170.4408 1171.9504 1223.6707 1234.0245 1259.7098 1288.3450 1294.0304 1364.4110 1371.8168 1396.5863 1400.4541 1414.9761 1415.7192 1447.9390 1464.4945 1470.7435 1475.2827 1481.5217 1498.2821 1525.9990 1556.8298 1588.7798 1598.7088 1610.0115 1626.8525 2962.9867 2973.2787 3034.5627 3049.7948 3083.4066 3087.8911 3110.5829 3130.3271 3141.6840 3154.7401 3166.3736 3178.4178 3199.1368 3480.3805
redmass: 4.6137 1.1501 4.2087 4.9075 5.4012 4.5136 4.1888 3.5473 2.4262 2.2191 2.3738 4.0329 6.5262 2.7232 7.4166 4.0190 10.9908 3.4663 3.1599 3.2216 5.8216 4.4252 5.6890 5.2483 2.8142 6.4288 3.7171 1.6609 3.3754 5.5930 3.3222 2.8329 1.5385 4.7625 1.3233 6.5703 1.3950 1.2966 3.3404 1.3597 1.5081 1.3255 6.7606 1.3517 1.5198 2.8303 1.5155 1.5658 2.7089 1.7531 1.9252 1.5404 1.0582 2.5016 1.8230 1.5807 4.2983 1.4593 7.0593 5.4037 1.2530 1.2821 2.8718 2.4548 2.2839 1.6289 1.0474 1.1149 1.0436 1.8041 2.1167 5.5244 8.3511 5.1254 3.4833 6.0819 1.0392 1.0375 1.0975 1.0973 1.0985 1.0961 1.0912 1.0913 1.0861 1.0902 1.0951 1.1002 1.0938 1.0768
irintensity: 1.4856 1.3999 1.7842 2.3152 1.0472 1.1038 0.7574 3.5778 4.2020 0.1421 0.6001 0.8628 0.0620 0.4434 5.1084 0.2407 26.5556 0.1939 11.3961 1.4392 1.3024 5.7934 2.6406 0.2402 13.4559 5.9062 1.4188 39.7098 29.2616 1.0317 1.1502 53.5447 46.6642 3.0759 52.4858 9.4399 0.5823 0.5069 9.7395 2.3592 10.3930 5.4679 37.5463 2.8013 7.4560 12.4966 0.8444 18.6676 0.8234 7.6796 3.5165 10.0638 5.5484 19.2888 20.1713 30.0588 22.0487 23.4994 2.8122 47.3491 8.5231 14.8954 2.1400 12.9630 69.7829 77.1347 14.0935 19.8619 13.5127 62.3296 359.6077 8.7952 135.0783 20.4457 30.8541 14.6169 25.9727 50.2293 18.6588 23.1317 18.1560 20.5539 29.6156 22.2074 4.1906 2.7977 9.2799 19.2618 7.3636 94.9957
temp: 298.150 k
press: 1.00000 atm
elementType: 17 8 7 6 6 6 6 6 6 6 6 6 6 6 6 6 6 6 1 1 1 1 1 1 1 1 1 1 1 1 1 1
symmnumber: 1
zpe: 654857.5 jmol-1
zpe.correction: 0.249422 hartree
zpe.thermalcorrener: 0.266281 hartree
zpe.thermalcorrenthalpy: 0.267226 hartree
zpe.thermalcorrgfe: 0.201227 hartree
zpe.sumelectzpe: -1168.783513 hartree
zpe.sumelectthermal: -1168.766654 hartree
zpe.sumelectthermalent: -1168.765710 hartree
zpe.sumelectthermalfe: -1168.831709 hartree
dipole: 1.5340 2.3242 0.7404
dipole: 2.8815
quadrupole: -84.1815 -110.6014 -118.1315
quadrupole: -3.4165 1.4283 -0.2072
quadrupole: 20.1233 -6.2966 -13.8267 -3.4165 1.4283 -0.2072
hfenergy: -1169.0329353 hartree
pointgroup: C01 [X(C15H14Cl1N1O1)]
dipole: -0.540048 -0.7381281 -0.6698812 debye
polarizability: 318.3894336|16.8969908|107.8437807|-16.694828|45.9548821|167.4669 unknown
InChI: InChI=1S/C15H14ClNO/c1-10-7-8-14(11(2)9-10)17-15(18)12-5-3-4-6-13(12)16/h3-9,17H,1-2H3
charge 0 multiplicity 1
32 atoms
Cl -1.863946 -1.265079 -2.217609
O  -0.576268 0.869242 1.782712
N  0.192285 -0.340858 -0.065461
C  1.601981 -0.135645 0.048283
C  2.440326 -0.76493 -0.929368
C  4.440115 0.202344 0.181482
C  3.836458 -0.580209 -0.836705
C  2.18632 0.648959 1.076489
C  3.586551 0.808855 1.132252
C  1.859743 -1.614683 -2.048224
C  -0.808019 0.144286 0.762074
C  -2.253606 -0.243238 0.452526
C  5.947208 0.38134 0.235456
C  -2.836339 -0.820876 -0.705519
C  -3.160327 0.053689 1.514344
C  -4.214853 -1.092435 -0.818693
C  -4.537783 -0.212255 1.432116
C  -5.073467 -0.790794 0.259026
H  4.476201 -1.064236 -1.586301
H  1.538205 1.12071 1.815645
H  4.017551 1.419569 1.934537
H  -0.10866 -0.905713 -0.865017
H  2.665312 -2.021491 -2.681166
H  1.279718 -2.477338 -1.663958
H  1.18758 -1.032243 -2.708882
H  6.471121 -0.592936 0.244134
H  6.318714 0.941393 -0.644191
H  6.253709 0.936868 1.138303
H  -2.71833 0.518368 2.401556
H  -4.60612 -1.532139 -1.740319
H  -5.190426 0.032071 2.276176
H  -6.144152 -1.003099 0.173802
