program: Gaussian 09
title: 000295079
version: EM64L-G09RevD.01
frameworkgroup: C1[X(C15H14ClNO)]
method: RPBEPBE
basis: SDD
operation: Freq
keyword: #p
keyword: freq=noraman
keyword: PBEPBE/SDD
title: #p freq=noraman PBEPBE/SDD
converged: YES YES NO NO
title: Mulliken charges:
elementType: Cl O N C C C C C C C C C C C C C C C H H H H H H H H H H H H H H
charge: -0.075076 -0.271113 -0.464895 0.089393 0.350593 0.376173 -0.367314 -0.455743 -0.874668 -0.227412 -0.844187 0.159598 0.300320 -0.259911 -0.318502 -0.228987 -0.234446 -0.216302 0.311063 0.229734 0.336494 0.264503 0.233441 0.239743 0.225689 0.229961 0.230824 0.233558 0.287013 0.259232 0.240121 0.241104
chargesum: 0.00000
title: Mulliken charges with hydrogens summed into heavy atoms:
elementType: Cl O N C C C C C C C C C C C C C C C
charge: -0.075076 -0.271113 -0.128401 0.089393 0.350593 0.376173 -0.056251 -0.226010 -0.136981 -0.001723 -0.149843 0.159598 0.300320 -0.259911 -0.031490 0.030245 0.005675 0.024802
polarizability: 2.99936763e+02 -7.63338020e+00 1.92565769e+02 1.05307454e+01 1.23297301e+00 8.67307586e+01
1716.lowfreq: -4.5518 -0.0005 0.0008 0.0023 4.1152 6.4176 13.1418 34.0984 62.7955
frequency: 12.7591 34.0707 62.7906 82.0226 112.3916 134.2896 163.7425 184.8519 193.9584 205.1580 224.2508 239.9101 279.1178 310.0644 329.3000 341.8542 405.8134 430.5865 450.1685 474.9228 493.8708 502.8773 514.1278 558.3667 568.7262 624.8507 656.3508 676.3086 681.7187 724.4758 733.6735 740.8197 776.7321 801.5719 805.1836 872.9089 879.8166 885.2511 920.9733 966.6855 993.4406 993.8921 1000.2316 1002.2027 1027.1607 1032.0317 1051.0090 1059.7331 1093.0418 1116.5139 1133.2672 1172.7835 1183.7200 1195.6019 1230.0256 1261.7955 1266.1887 1289.3055 1365.0198 1370.4637 1395.7779 1403.5631 1415.3014 1430.6655 1451.6709 1456.1382 1469.8333 1471.2934 1492.0011 1498.1426 1534.9088 1559.6264 1592.5300 1598.2796 1604.8385 1614.7164 2962.9696 2973.0509 3030.5025 3048.2469 3083.7312 3111.8020 3125.1717 3142.0675 3150.6135 3155.9831 3167.8136 3178.4385 3202.8255 3496.6538
redmass: 5.5888 5.5556 5.1391 4.9428 3.4475 2.7731 1.3490 1.4865 2.2476 5.3455 5.5684 2.9585 6.0553 3.7518 7.6044 2.6354 11.3314 3.9695 3.5240 4.3545 4.5928 3.1490 5.0297 4.9721 3.5025 6.2419 2.6591 4.2362 1.8857 5.6553 2.4670 2.6248 1.5468 1.4788 4.5779 5.2898 1.5537 2.3187 1.3413 1.3673 1.3779 1.3946 1.3606 6.2767 1.4418 2.8380 1.6223 1.9110 1.9451 1.7986 2.2423 1.0580 1.5623 2.0604 2.4268 1.5842 1.8675 2.8665 7.5970 6.0466 1.2801 1.2155 2.3313 2.4443 2.3099 2.2809 1.1490 1.1238 1.1902 1.0494 2.0744 5.2504 6.9905 6.5156 6.9333 3.5338 1.0417 1.0380 1.0975 1.0976 1.0977 1.0924 1.0873 1.0862 1.0961 1.0903 1.0949 1.1005 1.0946 1.0765
irintensity: 1.5975 2.5435 2.3642 1.7613 0.6179 0.3287 0.1862 2.2326 2.5481 0.9828 0.3303 1.4664 0.8501 9.0993 6.7148 0.1612 21.2952 2.3976 2.0493 4.5755 2.7553 0.0344 2.5008 5.1447 6.2982 6.1755 6.1081 23.2388 53.3276 10.5518 5.6646 39.4632 49.6763 62.0591 2.2364 13.5571 2.2228 5.0814 4.7224 2.7436 4.9398 6.7714 3.0204 40.5655 9.6330 7.8218 1.4356 4.2719 18.8922 4.6328 10.0056 4.1229 0.1091 4.2920 39.6571 14.4154 29.4353 40.5330 3.4296 78.1770 0.8675 15.9514 9.9107 69.0506 10.5606 72.6590 57.2655 50.2801 89.9610 4.6860 267.3978 8.2832 160.1689 33.7995 13.1311 19.5647 24.0233 37.4639 17.2502 21.3951 23.6587 17.5608 10.6740 3.3946 32.2799 4.9429 5.3424 19.0010 9.3915 61.2947
temp: 298.150 k
press: 1.00000 atm
elementType: 17 8 7 6 6 6 6 6 6 6 6 6 6 6 6 6 6 6 1 1 1 1 1 1 1 1 1 1 1 1 1 1
symmnumber: 1
zpe: 656234.8 jmol-1
zpe.correction: 0.249947 hartree
zpe.thermalcorrener: 0.266483 hartree
zpe.thermalcorrenthalpy: 0.267427 hartree
zpe.thermalcorrgfe: 0.204189 hartree
zpe.sumelectzpe: -1168.780670 hartree
zpe.sumelectthermal: -1168.764134 hartree
zpe.sumelectthermalent: -1168.763190 hartree
zpe.sumelectthermalfe: -1168.826428 hartree
dipole: 1.4166 2.8687 1.3677
dipole: 3.4795
quadrupole: -86.1922 -112.1070 -117.5463
quadrupole: -2.3203 2.6228 -0.2026
quadrupole: 19.0896 -6.8252 -12.2645 -2.3203 2.6228 -0.2026
hfenergy: -1169.0306171 hartree
pointgroup: C01 [X(C15H14Cl1N1O1)]
dipole: -0.4979294 -1.1072605 -0.6324617 debye
polarizability: 297.90506|17.2525785|121.6750461|-18.1194934|48.0308038|159.6531839 unknown
InChI: InChI=1S/C15H14ClNO/c1-10-6-5-9-14(11(10)2)17-15(18)12-7-3-4-8-13(12)16/h3-9,17H,1-2H3
charge 0 multiplicity 1
32 atoms
Cl -1.598162 -1.038436 -2.246151
O  -0.691362 1.194867 1.722459
N  0.280632 -0.201391 0.107952
C  2.598447 -0.673444 -0.503343
C  1.669742 0.090654 0.278034
C  3.991202 -0.406616 -0.374121
C  2.12296 1.091238 1.177445
C  4.429975 0.599695 0.524472
C  2.088118 -1.751077 -1.450221
C  3.504571 1.336351 1.291389
C  5.028765 -1.177165 -1.178482
C  -0.800575 0.33583 0.790906
C  -2.188624 -0.190007 0.437682
C  -2.667852 -0.777447 -0.760946
C  -3.151293 -0.019859 1.476447
C  -4.007017 -1.181778 -0.932886
C  -4.490579 -0.424088 1.33578
C  -4.924417 -1.011533 0.125292
H  1.395119 1.65035 1.765687
H  5.503435 0.800243 0.619008
H  0.059066 -0.877422 -0.6276
H  2.91617 -2.29468 -1.927534
H  1.471403 -2.50653 -0.923496
H  1.46955 -1.327218 -2.266277
H  3.856886 2.109311 1.983193
H  5.00704 -2.260872 -0.954687
H  4.875653 -1.065575 -2.268668
H  6.043968 -0.812819 -0.947505
H  -2.794208 0.463745 2.391131
H  -4.323564 -1.618646 -1.884096
H  -5.192993 -0.278235 2.162459
H  -5.964452 -1.327945 -0.004826
