program: Gaussian 09
title: 000295068
version: EM64L-G09RevD.01
frameworkgroup: C1[X(C12H18N2O)]
method: RPBEPBE
basis: SDD
operation: Freq
keyword: #p
keyword: freq=noraman
keyword: PBEPBE/SDD
title: #p freq=noraman PBEPBE/SDD
converged: YES YES NO NO
title: Mulliken charges:
elementType: O N N C C C C C C C C C C C C H H H H H H H H H H H H H H H H H H
charge: -0.280737 -0.416203 -0.515994 -0.012544 0.171459 0.365849 0.330453 -0.668999 -0.703522 0.252324 -0.413621 -0.421832 -0.237939 -0.828964 -0.845082 0.246518 0.279612 0.290813 0.209964 0.192949 0.252573 0.232378 0.222157 0.197212 0.229835 0.229269 0.223280 0.216901 0.285747 0.215377 0.237762 0.216221 0.246788
chargesum: 0.00000
title: Mulliken charges with hydrogens summed into heavy atoms:
elementType: O N N C C C C C C C C C C C C
charge: -0.280737 -0.136590 -0.225182 0.233974 0.171459 0.365849 0.330453 -0.013514 -0.051775 0.252324 -0.183786 -0.192563 -0.014660 -0.110941 -0.144312
polarizability: 2.04440328e+02 -1.50246016e+00 1.52427231e+02 7.92335514e+00 -3.41814171e+00 9.38595916e+01
1716.lowfreq: -0.0003 0.0004 0.0005 3.0308 4.2954 10.3338 30.9532 42.4479 61.8605
frequency: 30.6821 42.4419 61.8187 80.7860 102.3416 137.6594 181.4112 184.8612 207.0554 213.1691 230.1597 232.4449 256.1280 292.4779 315.9662 317.5615 348.9819 398.8284 432.2515 454.7808 471.6509 508.7071 515.3148 527.0248 534.7020 559.7889 678.5823 690.8505 725.6468 768.7228 775.7530 818.1805 864.1714 897.4662 912.9832 919.2488 937.0497 949.1736 970.1879 986.6133 1025.3664 1038.7206 1045.0211 1053.0377 1099.6474 1141.9332 1146.3599 1175.8961 1179.8299 1216.1042 1236.8557 1260.7269 1283.7745 1307.5480 1348.2992 1368.6560 1374.8221 1393.4013 1395.9450 1398.0617 1431.4295 1448.8800 1456.7290 1458.4658 1464.6427 1466.4445 1471.7389 1473.0290 1484.5094 1486.0192 1489.8451 1496.4053 1603.9946 1607.0804 1641.6891 2953.1424 2972.7439 2976.0407 2976.8167 3031.4344 3032.1009 3057.8280 3065.4521 3077.8930 3084.6060 3086.2346 3090.4451 3094.3461 3119.3122 3128.8124 3155.6221 3514.7830 3531.3287
redmass: 3.0738 3.3392 3.8902 4.6050 3.7853 3.7877 1.1474 1.6234 1.6456 1.0518 2.8380 2.1840 1.2058 3.2709 3.1423 2.7400 1.8258 2.5549 1.8815 2.7249 2.8601 2.2817 3.0583 2.3095 4.1517 2.9893 5.2274 6.3405 4.9143 4.3090 1.2829 3.4804 2.9013 1.3106 2.1894 1.3663 1.6902 1.9096 1.3414 1.5961 2.9218 1.6683 1.7483 1.5784 1.6601 2.1708 1.9617 1.1686 2.2007 2.1411 3.6139 1.7116 2.4203 1.5254 1.3009 4.9760 1.2217 1.2307 1.2643 1.2534 1.7683 1.6598 1.6808 1.1855 1.1025 1.0485 1.2101 1.2875 1.2016 1.0573 1.2852 1.4622 6.3543 6.0151 5.3649 1.0433 1.0376 1.0363 1.0367 1.0852 1.0911 1.0969 1.0978 1.0976 1.0997 1.0975 1.1002 1.1000 1.0856 1.0918 1.0994 1.0755 1.0766
irintensity: 0.1320 0.6606 0.3830 6.2608 3.9453 3.0664 1.9282 3.8306 5.7422 0.0529 5.8158 2.5261 2.6014 9.0203 1.5459 2.3648 11.2982 9.4642 27.1815 2.2441 20.6457 56.0739 3.4168 75.9408 3.5636 30.8116 3.9517 12.2129 25.4895 6.4069 50.2579 2.9265 0.5931 0.2514 4.2977 3.7588 2.3997 2.9032 0.1912 5.8653 3.7482 7.1993 2.4502 8.6248 24.8847 32.0826 8.2185 3.9382 55.0712 278.9513 21.7153 7.6621 28.1791 21.3756 6.5728 49.3131 25.7892 36.1901 30.1802 7.6092 21.6925 28.7889 121.0464 41.6576 17.3861 5.3031 124.4997 182.3318 153.0373 22.8369 18.1976 135.5955 7.0924 1.7699 145.2208 40.2100 24.4550 20.4339 41.8022 0.3860 21.8394 12.4029 6.7112 76.8595 22.3078 22.2812 21.5980 40.1378 0.4385 28.3293 35.3501 11.2662 15.0330
temp: 298.150 k
press: 1.00000 atm
elementType: 8 7 7 6 6 6 6 6 6 6 6 6 6 6 6 1 1 1 1 1 1 1 1 1 1 1 1 1 1 1 1 1 1
symmnumber: 1
zpe: 732434.4 jmol-1
zpe.correction: 0.278970 hartree
zpe.thermalcorrener: 0.295380 hartree
zpe.thermalcorrenthalpy: 0.296324 hartree
zpe.thermalcorrgfe: 0.234999 hartree
zpe.sumelectzpe: -651.694303 hartree
zpe.sumelectthermal: -651.677893 hartree
zpe.sumelectthermalent: -651.676949 hartree
zpe.sumelectthermalfe: -651.738274 hartree
dipole: -1.6804 2.4295 -3.0941
dipole: 4.2778
quadrupole: -79.5091 -84.5473 -95.1980
quadrupole: -1.5884 4.1317 -0.3528
quadrupole: 6.9091 1.8708 -8.7799 -1.5884 4.1317 -0.3528
hfenergy: -651.9732729 hartree
pointgroup: C01 [X(C12H18N2O1)]
dipole: -0.6904945 -0.7092262 1.3611629 debye
polarizability: 204.0244874|-3.3236092|150.0962193|-10.1314016|-11.7880846|96.6064443 unknown
InChI: InChI=1S/C12H18N2O/c1-8(2)13-12(15)14-11-9(3)6-5-7-10(11)4/h5-8,13-14H,1-4H3
charge 0 multiplicity 1
33 atoms
O  -1.173674 0.57426 -1.297845
N  -2.486134 -0.250034 0.457036
N  -0.151534 -0.397845 0.604024
C  -3.76754 0.089723 -0.200887
C  1.22385 -0.185725 0.257484
C  1.726629 1.126144 0.010558
C  2.085623 -1.324975 0.230948
C  -4.160175 1.564947 0.055077
C  -4.861025 -0.893358 0.263082
C  -1.263143 0.02341 -0.160415
C  3.103704 1.264264 -0.296353
C  3.457081 -1.137507 -0.056606
C  3.967515 0.149883 -0.331193
C  0.843793 2.353588 0.094182
C  1.537987 -2.718144 0.493167
H  -3.589338 -0.035069 -1.284229
H  -2.513163 -0.47724 1.453384
H  -0.328773 -1.1251 1.300912
H  -5.083411 1.823301 -0.495896
H  -4.34029 1.746174 1.132048
H  -3.353351 2.23477 -0.288263
H  -4.576141 -1.937229 0.042224
H  -5.813663 -0.676187 -0.251528
H  -5.044976 -0.802769 1.352167
H  3.499436 2.267798 -0.492798
H  4.121794 -2.009192 -0.080244
H  5.029824 0.283442 -0.563412
H  0.169114 2.303059 0.969705
H  0.197495 2.430104 -0.799141
H  1.452908 3.270209 0.175205
H  2.311603 -3.481898 0.307447
H  1.201528 -2.851998 1.542735
H  0.673748 -2.942004 -0.160373
